BDBM70361 2-[3-(4-methylphenyl)triazolo[4,5-d]pyrimidin-7-yl]sulfanyl-N-(oxolan-2-ylmethyl)acetamide::2-[[3-(4-methylphenyl)-7-triazolo[4,5-d]pyrimidinyl]thio]-N-(2-oxolanylmethyl)acetamide::2-[[3-(4-methylphenyl)-[1,2,3]triazolo[4,5-d]pyrimidin-7-yl]sulfanyl]-N-(oxolan-2-ylmethyl)ethanamide::2-[[3-(p-tolyl)triazolo[4,5-d]pyrimidin-7-yl]thio]-N-(tetrahydrofurfuryl)acetamide::2-{[3-(4-methylphenyl)-3H-[1,2,3]triazolo[4,5-d]pyrimidin-7-yl]thio}-N-(tetrahydrofuran-2-ylmethyl)acetamide::MLS000094039::SMR000029654::cid_3238888
SMILES Cc1ccc(cc1)-n1nnc2c(SCC(=O)NCC3CCCO3)ncnc12
InChI Key InChIKey=FKTATLDZMUDZJI-UHFFFAOYSA-N
Data  1 IC50  2 EC50
  Tab Delimited (TSV)   2D SDfile   Computed 3D by Vconf -m prep SDfile
Find this compound or compounds like it in BindingDB:
Activity Spreadsheet -- Enzyme Inhibition Constant Data from BindingDB
Found 3 hits for monomerid = 70361
TargetProtein RecA(Mycobacterium tuberculosis H37Rv)
Broad Institute
Curated by PubChem BioAssay
LigandPNGBDBM70361(2-[3-(4-methylphenyl)triazolo[4,5-d]pyrimidin-7-yl...)
Affinity DataEC50: >3.80E+5nM. Assay description: Keywords: GFP, refolding, reducing reagent, GFP fluorescence Assay Overview: M. tuberculosis harbors three inteins, which interrupt the DnaB, RecA, a...
In DepthDetails PCBioAssay
TargetProtein RecA(Mycobacterium tuberculosis H37Rv)
Broad Institute
Curated by PubChem BioAssay
LigandPNGBDBM70361(2-[3-(4-methylphenyl)triazolo[4,5-d]pyrimidin-7-yl...)
Affinity DataIC50:  4.64E+4nM. Assay description: Southern Research's Specialized Biocontainment Screening Center (SRSBSC) Southern Research Institute (Birmingham, Alabama) NIH Molecular Librarie...
In DepthDetails PCBioAssay
TargetProtein RecA(Mycobacterium tuberculosis H37Rv)
Broad Institute
Curated by PubChem BioAssay
LigandPNGBDBM70361(2-[3-(4-methylphenyl)triazolo[4,5-d]pyrimidin-7-yl...)
Affinity DataEC50:  4.23E+3nM. Assay description: Keywords: GFP-RecA intein, protein splicing, refolding, reducing reagent, GFP fluorescence Assay Overview: M. tuberculosis harbors three inteins, whi...
In DepthDetails PCBioAssay