BDBM70428 3-chloranyl-1-(2,5-dimethoxyphenyl)-4-morpholin-4-yl-pyrrole-2,5-dione::3-chloro-1-(2,5-dimethoxyphenyl)-4-(4-morpholinyl)pyrrole-2,5-dione::3-chloro-1-(2,5-dimethoxyphenyl)-4-morpholin-4-ylpyrrole-2,5-dione::3-chloro-1-(2,5-dimethoxyphenyl)-4-morpholino-3-pyrroline-2,5-quinone::MLS000106275::SMR000103244::cid_1379075
SMILES COc1ccc(OC)c(c1)N1C(=O)C(Cl)=C(N2CCOCC2)C1=O
InChI Key InChIKey=KMFXHEBBOCEAFT-UHFFFAOYSA-N
Data  2 EC50
  Tab Delimited (TSV)   2D SDfile   Computed 3D by Vconf -m prep SDfile
Find this compound or compounds like it in BindingDB:
Activity Spreadsheet -- Enzyme Inhibition Constant Data from BindingDB
Found 2 hits for monomerid = 70428
TargetProtein RecA(Mycobacterium tuberculosis H37Rv)
Broad Institute
Curated by PubChem BioAssay
LigandPNGBDBM70428(3-chloranyl-1-(2,5-dimethoxyphenyl)-4-morpholin-4-...)
Affinity DataEC50:  2.63E+4nM. Assay description: Keywords: GFP-RecA intein, protein splicing, refolding, reducing reagent, GFP fluorescence Assay Overview: M. tuberculosis harbors three inteins, whi...
In DepthDetails PCBioAssay
TargetProtein RecA(Mycobacterium tuberculosis H37Rv)
Broad Institute
Curated by PubChem BioAssay
LigandPNGBDBM70428(3-chloranyl-1-(2,5-dimethoxyphenyl)-4-morpholin-4-...)
Affinity DataEC50:  1.33E+5nM. Assay description: Keywords: GFP, refolding, reducing reagent, GFP fluorescence Assay Overview: M. tuberculosis harbors three inteins, which interrupt the DnaB, RecA, a...
In DepthDetails PCBioAssay