BDBM70712 Isonicotinic acid [1-(2-oxo-2H-chromen-3-yl)-eth-(E)-ylidene]-hydrazide::MLS000589272::N-[1-(2-ketochromen-3-yl)ethylideneamino]isonicotinamide::N-[1-(2-oxidanylidenechromen-3-yl)ethylideneamino]pyridine-4-carboxamide::N-[1-(2-oxo-1-benzopyran-3-yl)ethylideneamino]-4-pyridinecarboxamide::N-[1-(2-oxochromen-3-yl)ethylideneamino]pyridine-4-carboxamide::SMR000212640::cid_909897
SMILES CC(=NNC(=O)c1ccncc1)c1cc2ccccc2oc1=O
InChI Key InChIKey=UQNZJQUFLKWHHH-UHFFFAOYSA-N
Data  1 IC50
  Tab Delimited (TSV)   2D SDfile   Computed 3D by Vconf -m prep SDfile
Find this compound or compounds like it in BindingDB:
Activity Spreadsheet -- Enzyme Inhibition Constant Data from BindingDB
Found 1 hit for monomerid = 70712
TargetProtein RecA(Mycobacterium tuberculosis H37Rv)
Southern Research Specialized Biocontainment Screening Center
Curated by PubChem BioAssay
LigandPNGBDBM70712(Isonicotinic acid [1-(2-oxo-2H-chromen-3-yl)-eth-(...)
Affinity DataIC50:  290nM. Assay description: Southern Research's Specialized Biocontainment Screening Center (SRSBSC) Southern Research Institute (Birmingham, Alabama) NIH Molecular Librarie...
In DepthDetails PCBioAssay