BDBM70866 US9694002, 42
SMILES Fc1cc(O[C@@H]2CCCN(C2)c2cc(Cl)cc(Cl)c2)c(cc1C(=O)NS(=O)(=O)C1CC1)C1CC1
InChI Key InChIKey=XXTHLPZHBJNZIC-GOSISDBHSA-N
Data  1 IC50
  Tab Delimited (TSV)   2D SDfile   Computed 3D by Vconf -m prep SDfile
Find this compound or compounds like it in BindingDB:
Activity Spreadsheet -- Enzyme Inhibition Constant Data from BindingDB
Found 1 hit for monomerid = 70866
TargetSodium channel protein type 1/10/11/2/3/4/5/8/9 subunit alpha(Homo sapiens (Human))
Genentech
US Patent
LigandPNGBDBM70866(US9694002, 42)
Affinity DataIC50:  2.10nMpH: 7.4 T: 2°C. Assay description: Binding of this radioligand was preformed in 5 mL borosilicate glass test tubes at room temperature. Binding was initiated by adding membranes to inc...
In DepthDetails US Patent