BDBM71183 5-[1-(2-Chloro-acetyl)-5-phenyl-pyrazolidin-3-ylidene]-1,3-dimethyl-pyrimidine-2,4,6-trione::5-[1-(2-chloranylethanoyl)-5-phenyl-pyrazolidin-3-ylidene]-1,3-dimethyl-1,3-diazinane-2,4,6-trione::5-[1-(2-chloro-1-oxoethyl)-5-phenyl-3-pyrazolidinylidene]-1,3-dimethyl-1,3-diazinane-2,4,6-trione::5-[1-(2-chloroacetyl)-5-phenyl-pyrazolidin-3-ylidene]-1,3-dimethyl-barbituric acid::5-[1-(2-chloroacetyl)-5-phenylpyrazolidin-3-ylidene]-1,3-dimethyl-1,3-diazinane-2,4,6-trione::MLS000762995::SMR000439474::cid_6225124
SMILES CN1C(=O)C(C2=NN(C(C2)c2ccccc2)C(=O)CCl)C(=O)N(C)C1=O
InChI Key InChIKey=IPILMLRKTJYTKJ-UHFFFAOYSA-N
Data  1 IC50
  Tab Delimited (TSV)   2D SDfile   Computed 3D by Vconf -m prep SDfile
Find this compound or compounds like it in BindingDB:
Activity Spreadsheet -- Enzyme Inhibition Constant Data from BindingDB
Found 1 hit for monomerid = 71183
TargetProtein RecA(Mycobacterium tuberculosis H37Rv)
Southern Research Specialized Biocontainment Screening Center
Curated by PubChem BioAssay
LigandPNGBDBM71183(5-[1-(2-Chloro-acetyl)-5-phenyl-pyrazolidin-3-ylid...)
Affinity DataIC50:  8.27E+4nM. Assay description: Southern Research's Specialized Biocontainment Screening Center (SRSBSC) Southern Research Institute (Birmingham, Alabama) NIH Molecular Librarie...
In DepthDetails PCBioAssay