BDBM71365 2-[(10-methyl-2-phenazin-10-iumyl)amino]ethanol;perchlorate::2-[(10-methylphenazin-10-ium-2-yl)amino]ethanol;perchlorate::MLS001164888::SMR000540112::cid_24761053
SMILES Cn1c2ccccc2nc2cc\c(cc12)=[NH+]/CCO
InChI Key InChIKey=UFFSSWFJZSCGMP-LFIBNONCSA-O
Data  1 EC50
  Tab Delimited (TSV)   2D SDfile   Computed 3D by Vconf -m prep SDfile
Find this compound or compounds like it in BindingDB:
Activity Spreadsheet -- Enzyme Inhibition Constant Data from BindingDB
Found 1 hit for monomerid = 71365
TargetMitochondrial peptide methionine sulfoxide reductase(Bos taurus)
The Scripps Research Institute Molecular Screening Center
Curated by PubChem BioAssay
LigandPNGBDBM71365(2-[(10-methyl-2-phenazin-10-iumyl)amino]ethanol;pe...)
Affinity DataEC50:  3.53E+3nM. Assay description: Source (MLPCN Center Name): The Scripps Research Institute Molecular Screening Center (SRIMSC) Affiliation: The Scripps Research Institute, TSRI Assa...
In DepthDetails PCBioAssay