BDBM71559 2-(2-furanyl)-N-[2-(1-methyl-2-pyrrolidinyl)ethyl]-4-quinolinecarboxamide;2,2,2-trifluoroacetic acid::2-(2-furyl)-N-[2-(1-methylpyrrolidin-2-yl)ethyl]cinchoninamide;2,2,2-trifluoroacetic acid::2-(furan-2-yl)-N-[2-(1-methylpyrrolidin-2-yl)ethyl]quinoline-4-carboxamide;2,2,2-trifluoroacetic acid::2-(furan-2-yl)-N-[2-(1-methylpyrrolidin-2-yl)ethyl]quinoline-4-carboxamide;2,2,2-tris(fluoranyl)ethanoic acid::VU0410199-1::cid_44631804
SMILES CN1CCCC1CCNC(=O)c1cc(nc2ccccc12)-c1ccco1
InChI Key InChIKey=JNWYEODEBAGYHC-UHFFFAOYSA-N
Data  1 IC50
  Tab Delimited (TSV)   2D SDfile   Computed 3D by Vconf -m prep SDfile
Find this compound or compounds like it in BindingDB:
Activity Spreadsheet -- Enzyme Inhibition Constant Data from BindingDB
Found 1 hit for monomerid = 71559
TargetAmyloid-beta A4 precursor protein-binding family A member 1(Rattus norvegicus)
Burnham Center For Chemical Genomics
Curated by PubChem BioAssay
LigandPNGBDBM71559(2-(2-furanyl)-N-[2-(1-methyl-2-pyrrolidinyl)ethyl]...)
Affinity DataIC50:  2.45E+4nM. Assay description: Data Source: Sanford-Burnham Center for Chemical Genomics (SBCCG) Source Affiliation: Sanford-Burnham Medical Research Institute (SBMRI, San Diego, C...
In DepthDetails PCBioAssay