BDBM71571 KSC-5-267C::KUC104151N::N-[2-[(4-methylphenyl)methyl-propan-2-yl-amino]ethyl]-4-[[(3-methylphenyl)sulfonylamino]methyl]benzamide::N-[2-[(4-methylphenyl)methyl-propan-2-ylamino]ethyl]-4-[[(3-methylphenyl)sulfonylamino]methyl]benzamide::N-[2-[isopropyl-(4-methylbenzyl)amino]ethyl]-4-[(m-tolylsulfonylamino)methyl]benzamide::cid_44608029
SMILES CC(C)N(CCNC(=O)c1ccc(CNS(=O)(=O)c2cccc(C)c2)cc1)Cc1ccc(C)cc1
InChI Key InChIKey=LPXYXONGJPBSHG-UHFFFAOYSA-N
Data  4 IC50
  Tab Delimited (TSV)   2D SDfile   Computed 3D by Vconf -m prep SDfile
Find this compound or compounds like it in BindingDB:
Activity Spreadsheet -- Enzyme Inhibition Constant Data from BindingDB
Found 4 hits for monomerid = 71571
TargetKappa-type opioid receptor(Homo sapiens (Human))
Burnham Center For Chemical Genomics
Curated by PubChem BioAssay
LigandPNGBDBM71571(KSC-5-267C | KUC104151N | N-[2-[(4-methylphenyl)me...)
Affinity DataIC50:  1.83E+3nM. Assay description: Data Source: Burnham Center for Chemical Genomics (BCCG) Source Affiliation: Burnham Institute for Medical Research (BIMR, La Jolla, CA) Network: NIH...
In DepthDetails PCBioAssay
TargetMu-type opioid receptor(Homo sapiens (Human))
Burnham Center For Chemical Genomics
Curated by PubChem BioAssay
LigandPNGBDBM71571(KSC-5-267C | KUC104151N | N-[2-[(4-methylphenyl)me...)
Affinity DataIC50: >3.20E+4nM. Assay description: Data Source: Sanford-Burnham Center for Chemical Genomics (SBCCG) Source Affiliation: Sanford-Burnham Medical Research Institute (SBMRI, San Diego, C...
In DepthDetails PCBioAssay
TargetDelta-type opioid receptor(Homo sapiens (Human))
Burnham Center For Chemical Genomics
Curated by PubChem BioAssay
LigandPNGBDBM71571(KSC-5-267C | KUC104151N | N-[2-[(4-methylphenyl)me...)
Affinity DataIC50: >3.20E+4nM. Assay description: Data Source: Sanford-Burnham Center for Chemical Genomics (SBCCG) Source Affiliation: Sanford-Burnham Medical Research Institute (SBMRI, San Diego, C...
In DepthDetails PCBioAssay
TargetKappa-type opioid receptor(Homo sapiens (Human))
Burnham Center For Chemical Genomics
Curated by PubChem BioAssay
LigandPNGBDBM71571(KSC-5-267C | KUC104151N | N-[2-[(4-methylphenyl)me...)
Affinity DataIC50:  675nM. Assay description: Data Source: Sanford-Burnham Center for Chemical Genomics (SBCCG) Source Affiliation: Sanford-Burnham Medical Research Institute (SBMRI, San Diego, C...
In DepthDetails PCBioAssay