BDBM71606 4-(benzenesulfonamidomethyl)-N-[2-(dibenzylamino)ethyl]benzamide::4-(benzenesulfonamidomethyl)-N-[2-[bis(phenylmethyl)amino]ethyl]benzamide::KSC-11-59-1::KUC104498N::N-[2-[bis(phenylmethyl)amino]ethyl]-4-(phenylsulfonylaminomethyl)benzamide::cid_44665683
SMILES O=C(NCCN(Cc1ccccc1)Cc1ccccc1)c1ccc(CNS(=O)(=O)c2ccccc2)cc1
InChI Key InChIKey=VGDBZXXPXMPUSW-UHFFFAOYSA-N
Data  4 IC50
  Tab Delimited (TSV)   2D SDfile   Computed 3D by Vconf -m prep SDfile
Find this compound or compounds like it in BindingDB:
Activity Spreadsheet -- Enzyme Inhibition Constant Data from BindingDB
Found 4 hits for monomerid = 71606
TargetKappa-type opioid receptor(Homo sapiens (Human))
Burnham Center For Chemical Genomics
Curated by PubChem BioAssay
LigandPNGBDBM71606(4-(benzenesulfonamidomethyl)-N-[2-(dibenzylamino)e...)
Affinity DataIC50: >2.00E+4nM. Assay description: Data Source: Burnham Center for Chemical Genomics (BCCG) Source Affiliation: Burnham Institute for Medical Research (BIMR, La Jolla, CA) Network: NIH...
In DepthDetails PCBioAssay
TargetMu-type opioid receptor(Homo sapiens (Human))
Burnham Center For Chemical Genomics
Curated by PubChem BioAssay
LigandPNGBDBM71606(4-(benzenesulfonamidomethyl)-N-[2-(dibenzylamino)e...)
Affinity DataIC50: >3.20E+4nM. Assay description: Data Source: Sanford-Burnham Center for Chemical Genomics (SBCCG) Source Affiliation: Sanford-Burnham Medical Research Institute (SBMRI, San Diego, C...
In DepthDetails PCBioAssay
TargetDelta-type opioid receptor(Homo sapiens (Human))
Burnham Center For Chemical Genomics
Curated by PubChem BioAssay
LigandPNGBDBM71606(4-(benzenesulfonamidomethyl)-N-[2-(dibenzylamino)e...)
Affinity DataIC50: >3.20E+4nM. Assay description: Data Source: Sanford-Burnham Center for Chemical Genomics (SBCCG) Source Affiliation: Sanford-Burnham Medical Research Institute (SBMRI, San Diego, C...
In DepthDetails PCBioAssay
TargetKappa-type opioid receptor(Homo sapiens (Human))
Burnham Center For Chemical Genomics
Curated by PubChem BioAssay
LigandPNGBDBM71606(4-(benzenesulfonamidomethyl)-N-[2-(dibenzylamino)e...)
Affinity DataIC50: >3.20E+4nM. Assay description: Data Source: Sanford-Burnham Center for Chemical Genomics (SBCCG) Source Affiliation: Sanford-Burnham Medical Research Institute (SBMRI, San Diego, C...
In DepthDetails PCBioAssay