BDBM71607 4-(benzenesulfonamidomethyl)-N-[2-[benzyl(ethyl)amino]ethyl]benzamide::4-(benzenesulfonamidomethyl)-N-[2-[ethyl-(phenylmethyl)amino]ethyl]benzamide::KSC-11-61-1::KUC104499N::N-[2-[ethyl-(phenylmethyl)amino]ethyl]-4-(phenylsulfonylaminomethyl)benzamide::cid_44665688
SMILES CCN(CCNC(=O)c1ccc(CNS(=O)(=O)c2ccccc2)cc1)Cc1ccccc1
InChI Key InChIKey=ZMPAGEVFPRWLLT-UHFFFAOYSA-N
Data  4 IC50
  Tab Delimited (TSV)   2D SDfile   Computed 3D by Vconf -m prep SDfile
Find this compound or compounds like it in BindingDB:
Activity Spreadsheet -- Enzyme Inhibition Constant Data from BindingDB
Found 4 hits for monomerid = 71607
TargetKappa-type opioid receptor(Homo sapiens (Human))
Burnham Center For Chemical Genomics
Curated by PubChem BioAssay
LigandPNGBDBM71607(4-(benzenesulfonamidomethyl)-N-[2-[benzyl(ethyl)am...)
Affinity DataIC50:  4.86E+3nM. Assay description: Data Source: Burnham Center for Chemical Genomics (BCCG) Source Affiliation: Burnham Institute for Medical Research (BIMR, La Jolla, CA) Network: NIH...
In DepthDetails PCBioAssay
TargetMu-type opioid receptor(Homo sapiens (Human))
Burnham Center For Chemical Genomics
Curated by PubChem BioAssay
LigandPNGBDBM71607(4-(benzenesulfonamidomethyl)-N-[2-[benzyl(ethyl)am...)
Affinity DataIC50:  2.03E+3nM. Assay description: Data Source: Sanford-Burnham Center for Chemical Genomics (SBCCG) Source Affiliation: Sanford-Burnham Medical Research Institute (SBMRI, San Diego, C...
In DepthDetails PCBioAssay
TargetDelta-type opioid receptor(Homo sapiens (Human))
Burnham Center For Chemical Genomics
Curated by PubChem BioAssay
LigandPNGBDBM71607(4-(benzenesulfonamidomethyl)-N-[2-[benzyl(ethyl)am...)
Affinity DataIC50: >3.20E+4nM. Assay description: Data Source: Sanford-Burnham Center for Chemical Genomics (SBCCG) Source Affiliation: Sanford-Burnham Medical Research Institute (SBMRI, San Diego, C...
In DepthDetails PCBioAssay
TargetKappa-type opioid receptor(Homo sapiens (Human))
Burnham Center For Chemical Genomics
Curated by PubChem BioAssay
LigandPNGBDBM71607(4-(benzenesulfonamidomethyl)-N-[2-[benzyl(ethyl)am...)
Affinity DataIC50:  1.21E+4nM. Assay description: Data Source: Sanford-Burnham Center for Chemical Genomics (SBCCG) Source Affiliation: Sanford-Burnham Medical Research Institute (SBMRI, San Diego, C...
In DepthDetails PCBioAssay