BDBM71660 1-(2-Methyl-benzyl)-2-thiazol-5-yl-1H-benzoimidazole::5-[1-(2-methylbenzyl)benzimidazol-2-yl]thiazole::5-[1-[(2-methylphenyl)methyl]-2-benzimidazolyl]thiazole::5-[1-[(2-methylphenyl)methyl]benzimidazol-2-yl]-1,3-thiazole::MLS000034189::SMR000013419::cid_656217
SMILES Cc1ccccc1Cn1c(nc2ccccc12)-c1cncs1
InChI Key InChIKey=ZBXKGWCRJZOIMC-UHFFFAOYSA-N
Data  1 EC50
  Tab Delimited (TSV)   2D SDfile   Computed 3D by Vconf -m prep SDfile
Find this compound or compounds like it in BindingDB:
Activity Spreadsheet -- Enzyme Inhibition Constant Data from BindingDB
Found 1 hit for monomerid = 71660
TargetHeat shock factor protein 1(Mus musculus)
Broad Institute
Curated by PubChem BioAssay
LigandPNGBDBM71660(1-(2-Methyl-benzyl)-2-thiazol-5-yl-1H-benzoimidazo...)
Affinity DataEC50: >2.60E+5nM. Assay description: Keywords: Heat Shock Factor-1 (HSF-1), Stress Response, MG132, NIH3T3, Luminescence Assay Overview: Confirmation testing of small molecules identifie...
In DepthDetails PCBioAssay