BDBM7175 3-{4-[(4-methylpiperazine-1-)sulfonyl]phenyl}-3,4,10,11-tetraazatricyclo[7.3.0.0^{2,6}]dodeca-1(9),2(6),4,7,11-pentaene-5-carboxamide::dihydro-benzodipyrazole deriv. 7e
SMILES CN1CCN(CC1)S(=O)(=O)c1ccc(cc1)-n1nc(C(N)=O)c2ccc3[nH]ncc3c12
InChI Key InChIKey=RUOIDLYFQJFGQQ-UHFFFAOYSA-N
Data  1 IC50
  Tab Delimited (TSV)   2D SDfile   Computed 3D by Vconf -m prep SDfile
Find this compound or compounds like it in BindingDB:
Activity Spreadsheet -- Enzyme Inhibition Constant Data from BindingDB
Found 1 hit for monomerid = 7175
TargetCyclin-A2/Cyclin-dependent kinase 2(Homo sapiens (Human))
Nerviano Medical Sciences
LigandPNGBDBM7175(3-{4-[(4-methylpiperazine-1-)sulfonyl]phenyl}-3,4,...)
Affinity DataIC50:  150nMpH: 7.4 T: 2°C. Assay description: The biochemical activity of compounds was determined by incubation with specific enzymes and substrates in the presence ATP/[gamma-33P] ATP. After in...
In DepthDetails ArticlePubMed