BDBM71826 MLS000065539::N-cyclohexyl-2-ethoxy-5-methyl-benzenesulfonamide::N-cyclohexyl-2-ethoxy-5-methylbenzenesulfonamide::SMR000080136::cid_850126
SMILES CCOc1ccc(C)cc1S(=O)(=O)NC1CCCCC1
InChI Key InChIKey=BHMIZOQTYZPFHP-UHFFFAOYSA-N
Data  1 EC50
  Tab Delimited (TSV)   2D SDfile   Computed 3D by Vconf -m prep SDfile
Find this compound or compounds like it in BindingDB:
Activity Spreadsheet -- Enzyme Inhibition Constant Data from BindingDB
Found 1 hit for monomerid = 71826
TargetHeat shock factor protein 1(Mus musculus)
Broad Institute
Curated by PubChem BioAssay
LigandPNGBDBM71826(MLS000065539 | N-cyclohexyl-2-ethoxy-5-methyl-benz...)
Affinity DataEC50: >2.60E+5nM. Assay description: Keywords: Heat Shock Factor-1 (HSF-1), Stress Response, MG132, NIH3T3, Luminescence Assay Overview: Confirmation testing of small molecules identifie...
In DepthDetails PCBioAssay