BDBM71909 1-(4-methylphenyl)-4-oxidanylidene-7-phenyl-3-(phenylmethyl)pyrimido[1,2-b]pyridazin-5-ium-2-olate::1-(4-methylphenyl)-4-oxo-7-phenyl-3-(phenylmethyl)-2-pyrimido[1,2-b]pyridazin-5-iumolate::3-benzyl-1-(4-methylphenyl)-4-oxo-7-phenyl-4H-pyrimido[1,2-b]pyridazin-1-ium-2-olate::3-benzyl-1-(4-methylphenyl)-4-oxo-7-phenylpyrimido[1,2-b]pyridazin-5-ium-2-olate::3-benzyl-4-keto-7-phenyl-1-(p-tolyl)pyrimido[1,2-b]pyridazin-5-ium-2-olate::MLS000594499::SMR000113817::cid_3348121
SMILES Cc1ccc(cc1)-n1c2ccc(n[n+]2c([O-])c(Cc2ccccc2)c1=O)-c1ccccc1
InChI Key InChIKey=QJAKIKKJMJHLET-UHFFFAOYSA-N
Data  2 IC50  1 EC50
  Tab Delimited (TSV)   2D SDfile   Computed 3D by Vconf -m prep SDfile
Find this compound or compounds like it in BindingDB:
Activity Spreadsheet -- Enzyme Inhibition Constant Data from BindingDB
Found 3 hits for monomerid = 71909
TargetHeat shock factor protein 1(Mus musculus)
Broad Institute
Curated by PubChem BioAssay
LigandPNGBDBM71909(1-(4-methylphenyl)-4-oxidanylidene-7-phenyl-3-(phe...)
Affinity DataEC50: >2.60E+5nM. Assay description: Keywords: Heat Shock Factor-1 (HSF-1), Stress Response, MG132, NIH3T3, Luminescence Assay Overview: Confirmation testing of small molecules identifie...
In DepthDetails PCBioAssay
TargetSentrin-specific protease 1(Homo sapiens (Human))
Burnham Center For Chemical Genomics
Curated by PubChem BioAssay
LigandPNGBDBM71909(1-(4-methylphenyl)-4-oxidanylidene-7-phenyl-3-(phe...)
Affinity DataIC50:  5.80E+3nM
In DepthDetails PCBioAssay
TargetSentrin-specific protease 1(Homo sapiens (Human))
Burnham Center For Chemical Genomics
Curated by PubChem BioAssay
LigandPNGBDBM71909(1-(4-methylphenyl)-4-oxidanylidene-7-phenyl-3-(phe...)
Affinity DataIC50:  6.35E+3nM
In DepthDetails PCBioAssay