BDBM72522 4-(difluoromethyl)-2-mesyl-6-(p-tolyl)pyrimidine::4-(difluoromethyl)-6-(4-methylphenyl)-2-(methylsulfonyl)pyrimidine::4-(difluoromethyl)-6-(4-methylphenyl)-2-methylsulfonylpyrimidine::4-[bis(fluoranyl)methyl]-6-(4-methylphenyl)-2-methylsulfonyl-pyrimidine::MLS000730009::SMR000308286::cid_4247905
SMILES Cc1ccc(cc1)-c1cc(nc(n1)S(C)(=O)=O)C(F)F
InChI Key InChIKey=JLSPJPKCCSNAIO-UHFFFAOYSA-N
Data  1 EC50
  Tab Delimited (TSV)   2D SDfile   Computed 3D by Vconf -m prep SDfile
Find this compound or compounds like it in BindingDB:
Activity Spreadsheet -- Enzyme Inhibition Constant Data from BindingDB
Found 1 hit for monomerid = 72522
TargetHeat shock factor protein 1(Mus musculus)
Broad Institute
Curated by PubChem BioAssay
LigandPNGBDBM72522(4-(difluoromethyl)-2-mesyl-6-(p-tolyl)pyrimidine |...)
Affinity DataEC50:  1.31E+4nM. Assay description: Keywords: Heat Shock Factor-1 (HSF-1), Stress Response, MG132, NIH3T3, Luminescence Assay Overview: Confirmation testing of small molecules identifie...
In DepthDetails PCBioAssay