BDBM72881 (2Z)-2-[(4-nitrophenyl)methylidene]-6-oxidanyl-1-benzofuran-3-one::(2Z)-6-hydroxy-2-(4-nitrobenzylidene)coumaran-3-one::(2Z)-6-hydroxy-2-[(4-nitrophenyl)methylidene]-1-benzofuran-3-one::(2Z)-6-hydroxy-2-[(4-nitrophenyl)methylidene]-3-benzofuranone::MLS001215098::SMR000543182::cid_940606
SMILES Oc1ccc2C(=O)\C(Oc2c1)=C\c1ccc(cc1)[N+]([O-])=O
InChI Key InChIKey=SJNIVFZEKRLLEP-AUWJEWJLSA-N
Data  2 IC50  1 EC50
  Tab Delimited (TSV)   2D SDfile   Computed 3D by Vconf -m prep SDfile
Find this compound or compounds like it in BindingDB:
Activity Spreadsheet -- Enzyme Inhibition Constant Data from BindingDB
Found 3 hits for monomerid = 72881
TargetHeat shock factor protein 1(Mus musculus)
Broad Institute
Curated by PubChem BioAssay
LigandPNGBDBM72881((2Z)-2-[(4-nitrophenyl)methylidene]-6-oxidanyl-1-b...)
Affinity DataEC50:  1.75E+5nM. Assay description: Keywords: Heat Shock Factor-1 (HSF-1), Stress Response, MG132, NIH3T3, Luminescence Assay Overview: Confirmation testing of small molecules identifie...
In DepthDetails PCBioAssay
TargetSentrin-specific protease 1(Homo sapiens (Human))
Burnham Center For Chemical Genomics
Curated by PubChem BioAssay
LigandPNGBDBM72881((2Z)-2-[(4-nitrophenyl)methylidene]-6-oxidanyl-1-b...)
Affinity DataIC50:  3.84E+4nM
In DepthDetails PCBioAssay
TargetSentrin-specific protease 1(Homo sapiens (Human))
Burnham Center For Chemical Genomics
Curated by PubChem BioAssay
LigandPNGBDBM72881((2Z)-2-[(4-nitrophenyl)methylidene]-6-oxidanyl-1-b...)
Affinity DataIC50:  1.01E+4nM
In DepthDetails PCBioAssay