BDBM72932 (5Z)-5-(4-chloro-3-nitro-benzylidene)-3-[2-(dimethylamino)ethyl]-2-(4-methoxyphenyl)imino-thiazolidin-4-one;hydrochloride::(5Z)-5-[(4-chloranyl-3-nitro-phenyl)methylidene]-3-[2-(dimethylamino)ethyl]-2-(4-methoxyphenyl)imino-1,3-thiazolidin-4-one;hydrochloride::(5Z)-5-[(4-chloro-3-nitrophenyl)methylidene]-3-[2-(dimethylamino)ethyl]-2-(4-methoxyphenyl)imino-1,3-thiazolidin-4-one;hydrochloride::(5Z)-5-[(4-chloro-3-nitrophenyl)methylidene]-3-[2-(dimethylamino)ethyl]-2-(4-methoxyphenyl)imino-4-thiazolidinone;hydrochloride::MLS001171702::SMR000587962::cid_16241593
SMILES COc1ccc(cc1)\N=C1\S\C(=C/c2ccc(Cl)c(c2)[N+]([O-])=O)C(=O)N1CCN(C)C
InChI Key InChIKey=WWGKYTVOQWOYFW-XMFNYGHISA-N
Data  2 IC50  1 EC50
  Tab Delimited (TSV)   2D SDfile   Computed 3D by Vconf -m prep SDfile
Find this compound or compounds like it in BindingDB:
Activity Spreadsheet -- Enzyme Inhibition Constant Data from BindingDB
Found 3 hits for monomerid = 72932
TargetHeat shock factor protein 1(Mus musculus)
Broad Institute
Curated by PubChem BioAssay
LigandPNGBDBM72932((5Z)-5-(4-chloro-3-nitro-benzylidene)-3-[2-(dimeth...)
Affinity DataEC50:  7.54E+3nM. Assay description: Keywords: Heat Shock Factor-1 (HSF-1), Stress Response, MG132, NIH3T3, Luminescence Assay Overview: Confirmation testing of small molecules identifie...
In DepthDetails PCBioAssay
TargetReceptor-interacting serine/threonine-protein kinase 2(Homo sapiens (Human))
The Scripps Research Institute Molecular Screening Center
Curated by PubChem BioAssay
LigandPNGBDBM72932((5Z)-5-(4-chloro-3-nitro-benzylidene)-3-[2-(dimeth...)
Affinity DataIC50:  1.50E+3nM
In DepthDetails PCBioAssay
TargetBeta-lactamase(Pseudomonas aeruginosa)
The Scripps Research Institute Molecular Screening Center
Curated by PubChem BioAssay
LigandPNGBDBM72932((5Z)-5-(4-chloro-3-nitro-benzylidene)-3-[2-(dimeth...)
Affinity DataIC50: >4.97E+4nM
In DepthDetails PCBioAssay