BDBM73104 2-[2,5-diketo-4,4-bis(4-methoxyphenyl)imidazolidin-1-yl]-N-methyl-N-phenyl-acetamide::2-[4,4-bis(4-methoxyphenyl)-2,5-bis(oxidanylidene)imidazolidin-1-yl]-N-methyl-N-phenyl-ethanamide::2-[4,4-bis(4-methoxyphenyl)-2,5-dioxo-1-imidazolidinyl]-N-methyl-N-phenylacetamide::2-[4,4-bis(4-methoxyphenyl)-2,5-dioxoimidazolidin-1-yl]-N-methyl-N-phenylacetamide::MLS001149867::SMR000688076::cid_24671733
SMILES COc1ccc(cc1)C1(NC(=O)N(CC(=O)N(C)c2ccccc2)C1=O)c1ccc(OC)cc1
InChI Key InChIKey=NQLWTOPCVQADFJ-UHFFFAOYSA-N
Data  1 EC50
  Tab Delimited (TSV)   2D SDfile   Computed 3D by Vconf -m prep SDfile
Find this compound or compounds like it in BindingDB:
Activity Spreadsheet -- Enzyme Inhibition Constant Data from BindingDB
Found 1 hit for monomerid = 73104
TargetHeat shock factor protein 1(Mus musculus)
Broad Institute
Curated by PubChem BioAssay
LigandPNGBDBM73104(2-[2,5-diketo-4,4-bis(4-methoxyphenyl)imidazolidin...)
Affinity DataEC50: >2.60E+5nM. Assay description: Keywords: Heat Shock Factor-1 (HSF-1), Stress Response, MG132, NIH3T3, Luminescence Assay Overview: Confirmation testing of small molecules identifie...
In DepthDetails PCBioAssay