BDBM73186 MLS-0374858.0001::N-(3,4-dimethoxyphenyl)-2-[6-(furan-2-yl)pyridazin-3-yl]sulfanyl-ethanamide::N-(3,4-dimethoxyphenyl)-2-[6-(furan-2-yl)pyridazin-3-yl]sulfanylacetamide::N-(3,4-dimethoxyphenyl)-2-[[6-(2-furanyl)-3-pyridazinyl]thio]acetamide::N-(3,4-dimethoxyphenyl)-2-[[6-(2-furyl)pyridazin-3-yl]thio]acetamide::cid_7207135
SMILES COc1ccc(NC(=O)CSc2ccc(nn2)-c2ccco2)cc1OC
InChI Key InChIKey=JGYOPPKJODCNEG-UHFFFAOYSA-N
Data  4 IC50
  Tab Delimited (TSV)   2D SDfile   Computed 3D by Vconf -m prep SDfile
Find this compound or compounds like it in BindingDB:
Activity Spreadsheet -- Enzyme Inhibition Constant Data from BindingDB
Found 4 hits for monomerid = 73186
TargetEukaryotic translation initiation factor 4H(Homo sapiens (Human))
Burnham Center For Chemical Genomics
Curated by PubChem BioAssay
LigandPNGBDBM73186(MLS-0374858.0001 | N-(3,4-dimethoxyphenyl)-2-[6-(f...)
Affinity DataIC50:  7.38E+4nM. Assay description: Data Source: Sanford-Burnham Center for Chemical Genomics (SBCCG) Source Affiliation: Sanford-Burnham Medical Research Institute (SBIMR, San Diego, C...
In DepthDetails PCBioAssay
TargetHexokinase HKDC1 [W721R](Homo sapiens (Human))
Burnham Center For Chemical Genomics
Curated by PubChem BioAssay
LigandPNGBDBM73186(MLS-0374858.0001 | N-(3,4-dimethoxyphenyl)-2-[6-(f...)
Affinity DataIC50:  1.77E+4nM. Assay description: Data Source: Sanford-Burnham Center for Chemical Genomics (SBCCG) Source Affiliation: Sanford-Burnham Medical Research Institute (SBMRI, San Diego, C...
In DepthDetails PCBioAssay
TargetHexokinase HKDC1 [W721R](Homo sapiens (Human))
Burnham Center For Chemical Genomics
Curated by PubChem BioAssay
LigandPNGBDBM73186(MLS-0374858.0001 | N-(3,4-dimethoxyphenyl)-2-[6-(f...)
Affinity DataIC50:  1.36E+4nM. Assay description: Data Source: Sanford-Burnham Center for Chemical Genomics (SBCCG) Source Affiliation: Sanford-Burnham Medical Research Institute (SBMRI, San Diego, C...
In DepthDetails PCBioAssay
TargetPolyadenylate-binding protein 1(Homo sapiens (Human))
Burnham Center For Chemical Genomics
Curated by PubChem BioAssay
LigandPNGBDBM73186(MLS-0374858.0001 | N-(3,4-dimethoxyphenyl)-2-[6-(f...)
Affinity DataIC50: >1.00E+5nM. Assay description: Data Source: Sanford-Burnham Center for Chemical Genomics (SBCCG) Source Affiliation: Sanford-Burnham Medical Research Institute(SBMRI, San Diego, CA...
In DepthDetails PCBioAssay