BDBM73231 Cyclobutanecarboxylic acid [2-(3-cyano-7,8-dimethyl-quinolin-2-ylamino)-ethyl]-amide::MLS000033065::N-[2-[(3-cyano-7,8-dimethyl-2-quinolinyl)amino]ethyl]cyclobutanecarboxamide::N-[2-[(3-cyano-7,8-dimethyl-2-quinolyl)amino]ethyl]cyclobutanecarboxamide::N-[2-[(3-cyano-7,8-dimethyl-quinolin-2-yl)amino]ethyl]cyclobutanecarboxamide::N-[2-[(3-cyano-7,8-dimethylquinolin-2-yl)amino]ethyl]cyclobutanecarboxamide::SMR000006855::cid_654217
SMILES Cc1ccc2cc(C#N)c(NCCNC(=O)C3CCC3)nc2c1C
InChI Key InChIKey=PWXOYEXDANQRIV-UHFFFAOYSA-N
Data  2 EC50
  Tab Delimited (TSV)   2D SDfile   Computed 3D by Vconf -m prep SDfile
Find this compound or compounds like it in BindingDB:
Activity Spreadsheet -- Enzyme Inhibition Constant Data from BindingDB
Found 2 hits for monomerid = 73231
TargetProtein LANA1(Human herpesvirus 8)
Broad Institute
Curated by PubChem BioAssay
LigandPNGBDBM73231(Cyclobutanecarboxylic acid [2-(3-cyano-7,8-dimethy...)
Affinity DataEC50: >7.50E+4nM. Assay description: Primary Collaborators: Kenneth Kaye,Brigham & Womens,Boston MA,kkaye@rics.bwh.harvard.edu,617-525-4256 Chantal Beauchemin,Brigham & Womens,Boston MA,...
In DepthDetails PCBioAssay
TargetImportin subunit alpha-1(Homo sapiens (Human))
Broad Institute
Curated by PubChem BioAssay
LigandPNGBDBM73231(Cyclobutanecarboxylic acid [2-(3-cyano-7,8-dimethy...)
Affinity DataEC50:  5.64E+4nM. Assay description: Keywords: Counterscreen, FRET assay, HTS, YIC probe, Dose response, Assay Overview: This is a fluorescence resonance energy transfer (FRET)-based b...
In DepthDetails PCBioAssay