BDBM73396 1-{[3-(2-chloro-6-fluorophenyl)-5-methyl-4-isoxazolyl]carbonyl}indoline::MLS000538982::SMR000144798::[3-(2-chloranyl-6-fluoranyl-phenyl)-5-methyl-1,2-oxazol-4-yl]-(2,3-dihydroindol-1-yl)methanone::[3-(2-chloro-6-fluoro-phenyl)-5-methyl-isoxazol-4-yl]-indolin-1-yl-methanone::[3-(2-chloro-6-fluorophenyl)-5-methyl-1,2-oxazol-4-yl]-(2,3-dihydroindol-1-yl)methanone::[3-(2-chloro-6-fluorophenyl)-5-methyl-4-isoxazolyl]-(2,3-dihydroindol-1-yl)methanone::cid_1247571
SMILES Cc1onc(c1C(=O)N1CCc2ccccc12)-c1c(F)cccc1Cl
InChI Key InChIKey=PMTIYQBEPKCLTG-UHFFFAOYSA-N
Data  1 EC50
  Tab Delimited (TSV)   2D SDfile   Computed 3D by Vconf -m prep SDfile
Find this compound or compounds like it in BindingDB:
Activity Spreadsheet -- Enzyme Inhibition Constant Data from BindingDB
Found 1 hit for monomerid = 73396
TargetProtein LANA1(Human herpesvirus 8)
Broad Institute
Curated by PubChem BioAssay
LigandPNGBDBM73396(1-{[3-(2-chloro-6-fluorophenyl)-5-methyl-4-isoxazo...)
Affinity DataEC50: >7.50E+4nM. Assay description: Primary Collaborators: Kenneth Kaye,Brigham & Womens,Boston MA,kkaye@rics.bwh.harvard.edu,617-525-4256 Chantal Beauchemin,Brigham & Womens,Boston MA,...
In DepthDetails PCBioAssay