BDBM73525 2-[(2Z)-2-(1-hexyl-2-pyridinylidene)ethylidene]propanedinitrile::2-[(2Z)-2-(1-hexyl-2-pyridylidene)ethylidene]malononitrile::2-[(2Z)-2-(1-hexylpyridin-2-ylidene)ethylidene]propanedinitrile::2-[2-(1-hexyl-2(1H)-pyridinylidene)ethylidene]malononitrile::MLS000699916::SMR000225117::cid_6373566
SMILES [#6]-[#6]-[#6]-[#6]-[#6]-[#6]-[#7]1-[#6]=[#6]-[#6]=[#6]\[#6]-1=[#6]\[#6]=[#6](\C#N)C#N
InChI Key InChIKey=NAINCYHPYCPJEE-YBEGLDIGSA-N
Data  1 IC50  1 EC50
  Tab Delimited (TSV)   2D SDfile   Computed 3D by Vconf -m prep SDfile
Find this compound or compounds like it in BindingDB:
Activity Spreadsheet -- Enzyme Inhibition Constant Data from BindingDB
Found 2 hits for monomerid = 73525
TargetProtein LANA1(Human herpesvirus 8)
Broad Institute
Curated by PubChem BioAssay
LigandPNGBDBM73525(2-[(2Z)-2-(1-hexyl-2-pyridinylidene)ethylidene]pro...)
Affinity DataEC50: >7.50E+4nM. Assay description: Primary Collaborators: Kenneth Kaye,Brigham & Womens,Boston MA,kkaye@rics.bwh.harvard.edu,617-525-4256 Chantal Beauchemin,Brigham & Womens,Boston MA,...
In DepthDetails PCBioAssay
TargetInsulin-degrading enzyme(Homo sapiens (Human))
The Scripps Research Institute Molecular Screening Center
Curated by PubChem BioAssay
LigandPNGBDBM73525(2-[(2Z)-2-(1-hexyl-2-pyridinylidene)ethylidene]pro...)
Affinity DataIC50: >6.22E+3nM. Assay description: Source (MLPCN Center Name): The Scripps Research Institute Molecular Screening Center (SRIMSC) Center Affiliation: The Scripps Research Institute (TS...
In DepthDetails PCBioAssay