BDBM74399 MLS002174212::SMR001261379::cid_42601183
SMILES [H][C@]12COc3ccc(C)cc3[C@]1([H])N1C(=O)c3cc(C)ccc3NC(=O)[C@@]1(C)[C@H]2c1ccccc1
InChI Key InChIKey=WYGQBRHZVKMZDA-PUWQJRQGSA-N
Data  1 EC50
  Tab Delimited (TSV)   2D SDfile   Computed 3D by Vconf -m prep SDfile
Find this compound or compounds like it in BindingDB:
Activity Spreadsheet -- Enzyme Inhibition Constant Data from BindingDB
Found 1 hit for monomerid = 74399
TargetProtein LANA1(Human herpesvirus 8)
Broad Institute
Curated by PubChem BioAssay
LigandPNGBDBM74399(MLS002174212 | SMR001261379 | cid_42601183)
Affinity DataEC50: >7.50E+4nM. Assay description: Primary Collaborators: Kenneth Kaye,Brigham & Womens,Boston MA,kkaye@rics.bwh.harvard.edu,617-525-4256 Chantal Beauchemin,Brigham & Womens,Boston MA,...
In DepthDetails PCBioAssay