BDBM74433 1-[(2S,3S)-2-[[(4-fluorophenyl)sulfonyl-methyl-amino]methyl]-3-methyl-6-oxidanylidene-5-[(2R)-1-oxidanylpropan-2-yl]-3,4-dihydro-2H-1,5-benzoxazocin-10-yl]-3-phenyl-urea::1-[(2S,3S)-2-[[(4-fluorophenyl)sulfonyl-methyl-amino]methyl]-5-[(1R)-2-hydroxy-1-methyl-ethyl]-6-keto-3-methyl-3,4-dihydro-2H-1,5-benzoxazocin-10-yl]-3-phenyl-urea::1-[(2S,3S)-2-[[(4-fluorophenyl)sulfonyl-methylamino]methyl]-5-[(2R)-1-hydroxypropan-2-yl]-3-methyl-6-oxo-3,4-dihydro-2H-1,5-benzoxazocin-10-yl]-3-phenylurea::MLS002473960::SMR001398121::cid_44202563
SMILES C[C@H](CO)N1C[C@H](C)[C@@H](CN(C)S(=O)(=O)c2ccc(F)cc2)Oc2c(NC(=O)Nc3ccccc3)cccc2C1=O
InChI Key InChIKey=AKKJKVUGLJLDGZ-OUDXUNEISA-N
Data  1 EC50
  Tab Delimited (TSV)   2D SDfile   Computed 3D by Vconf -m prep SDfile
Find this compound or compounds like it in BindingDB:
Activity Spreadsheet -- Enzyme Inhibition Constant Data from BindingDB
Found 1 hit for monomerid = 74433
TargetProtein LANA1(Human herpesvirus 8)
Broad Institute
Curated by PubChem BioAssay
LigandPNGBDBM74433(1-[(2S,3S)-2-[[(4-fluorophenyl)sulfonyl-methyl-ami...)
Affinity DataEC50: >7.50E+4nM. Assay description: Primary Collaborators: Kenneth Kaye,Brigham & Womens,Boston MA,kkaye@rics.bwh.harvard.edu,617-525-4256 Chantal Beauchemin,Brigham & Womens,Boston MA,...
In DepthDetails PCBioAssay