BDBM74475 3-[3-(dimethylamino)propyl]-2-(4-methoxyphenyl)-1,3-thiazolidin-4-one hydrochloride::3-[3-(dimethylamino)propyl]-2-(4-methoxyphenyl)-1,3-thiazolidin-4-one;hydrochloride::3-[3-(dimethylamino)propyl]-2-(4-methoxyphenyl)-4-thiazolidinone;hydrochloride::3-[3-(dimethylamino)propyl]-2-(4-methoxyphenyl)thiazolidin-4-one;hydrochloride::MLS000533188::SMR000140626::cid_2860932
SMILES COc1ccc(cc1)C1SCC(=O)N1CCCN(C)C
InChI Key InChIKey=CPILGZZHWWNMTE-UHFFFAOYSA-N
Data  4 IC50
  Tab Delimited (TSV)   2D SDfile   Computed 3D by Vconf -m prep SDfile
Find this compound or compounds like it in BindingDB:
Activity Spreadsheet -- Enzyme Inhibition Constant Data from BindingDB
Found 4 hits for monomerid = 74475
TargetTyrosine-protein phosphatase non-receptor type 22(Homo sapiens (Human))
Burnham Center For Chemical Genomics
Curated by PubChem BioAssay
LigandPNGBDBM74475(3-[3-(dimethylamino)propyl]-2-(4-methoxyphenyl)-1,...)
Affinity DataIC50: >7.94E+4nM. Assay description: Data Source: Sanford-Burnham Center for Chemical Genomics (SBCCG) Source Affiliation: Sanford-Burnham Medical Research Institute (SBMRI, San Diego, ...
In DepthDetails PCBioAssay
TargetHistamine H1 receptor(Cavia porcellus (domestic guinea pig))
Universit£
Curated by ChEMBL
LigandPNGBDBM74475(3-[3-(dimethylamino)propyl]-2-(4-methoxyphenyl)-1,...)
Affinity DataIC50: >1.00E+5nM. Assay description: In vitro for histamine H1 receptor antagonist activity against histamine-induced contractions on isolated guinea pig ileum
In DepthDetails ArticlePubMed
TargetTyrosine-protein phosphatase non-receptor type 22(Homo sapiens (Human))
Burnham Center For Chemical Genomics
Curated by PubChem BioAssay
LigandPNGBDBM74475(3-[3-(dimethylamino)propyl]-2-(4-methoxyphenyl)-1,...)
Affinity DataIC50: >7.94E+4nM. Assay description: Data Source: Sanford-Burnham Center for Chemical Genomics (SBCCG) Source Affiliation: Sanford-Burnham Medical Research Institute (SBMRI, San Diego, ...
In DepthDetails PCBioAssay
TargetTyrosine-protein phosphatase non-receptor type 7(Homo sapiens (Human))
Burnham Center For Chemical Genomics
Curated by PubChem BioAssay
LigandPNGBDBM74475(3-[3-(dimethylamino)propyl]-2-(4-methoxyphenyl)-1,...)
Affinity DataIC50: >7.94E+4nM. Assay description: Data Source: Sanford-Burnham Center for Chemical Genomics (SBCCG) Source Affiliation: Sanford-Burnham Medical Research Institute (SBMRI, San Diego, C...
In DepthDetails PCBioAssay