BDBM74485 2-[4-[4-(4-methylphenyl)-1-piperazinyl]butyl]-5,6,7,7a-tetrahydropyrrolo[1,2-c]imidazole-1,3-dione;hydrochloride::2-[4-[4-(4-methylphenyl)piperazin-1-yl]butyl]-5,6,7,7a-tetrahydropyrrolo[1,2-c]imidazole-1,3-dione;hydrochloride::2-[4-[4-(p-tolyl)piperazino]butyl]-5,6,7,7a-tetrahydropyrrol[1,2-c]imidazole-1,3-quinone;hydrochloride::2-{4-[4-(4-methylphenyl)-1-piperazinyl]butyl}tetrahydro-1H-pyrrolo[1,2-c]imidazole-1,3(2H)-dione::MLS000756208::SMR000229960::cid_15944977
SMILES Cc1ccc(cc1)N1CCN(CCCCN2C(=O)C3CCCN3C2=O)CC1
InChI Key InChIKey=HRJHDAXXWFXELB-UHFFFAOYSA-N
Data  3 IC50
  Tab Delimited (TSV)   2D SDfile   Computed 3D by Vconf -m prep SDfile
Find this compound or compounds like it in BindingDB:
Activity Spreadsheet -- Enzyme Inhibition Constant Data from BindingDB
Found 3 hits for monomerid = 74485
TargetTyrosine-protein phosphatase non-receptor type 22(Homo sapiens (Human))
Burnham Center For Chemical Genomics
Curated by PubChem BioAssay
LigandPNGBDBM74485(2-[4-[4-(4-methylphenyl)-1-piperazinyl]butyl]-5,6,...)
Affinity DataIC50: >7.94E+4nM. Assay description: Data Source: Sanford-Burnham Center for Chemical Genomics (SBCCG) Source Affiliation: Sanford-Burnham Medical Research Institute (SBMRI, San Diego, ...
In DepthDetails PCBioAssay
TargetTyrosine-protein phosphatase non-receptor type 22(Homo sapiens (Human))
Burnham Center For Chemical Genomics
Curated by PubChem BioAssay
LigandPNGBDBM74485(2-[4-[4-(4-methylphenyl)-1-piperazinyl]butyl]-5,6,...)
Affinity DataIC50: >7.94E+4nM. Assay description: Data Source: Sanford-Burnham Center for Chemical Genomics (SBCCG) Source Affiliation: Sanford-Burnham Medical Research Institute (SBMRI, San Diego, ...
In DepthDetails PCBioAssay
TargetTyrosine-protein phosphatase non-receptor type 7(Homo sapiens (Human))
Burnham Center For Chemical Genomics
Curated by PubChem BioAssay
LigandPNGBDBM74485(2-[4-[4-(4-methylphenyl)-1-piperazinyl]butyl]-5,6,...)
Affinity DataIC50: >7.94E+4nM. Assay description: Data Source: Sanford-Burnham Center for Chemical Genomics (SBCCG) Source Affiliation: Sanford-Burnham Medical Research Institute (SBMRI, San Diego, C...
In DepthDetails PCBioAssay