BDBM74490 4-chloranyl-1-methyl-N-[1-[(2-methylphenyl)methyl]pyrazol-4-yl]pyrazole-3-carboxamide::4-chloro-1-methyl-N-[1-(2-methylbenzyl)-1H-pyrazol-4-yl]-1H-pyrazole-3-carboxamide::4-chloro-1-methyl-N-[1-(2-methylbenzyl)pyrazol-4-yl]pyrazole-3-carboxamide::4-chloro-1-methyl-N-[1-[(2-methylphenyl)methyl]-4-pyrazolyl]-3-pyrazolecarboxamide::4-chloro-1-methyl-N-[1-[(2-methylphenyl)methyl]pyrazol-4-yl]pyrazole-3-carboxamide::MLS000706054::SMR000227352::cid_3421069
SMILES Cc1ccccc1Cn1cc(NC(=O)c2nn(C)cc2Cl)cn1
InChI Key InChIKey=XTNQMRODFQPLFA-UHFFFAOYSA-N
Data  3 IC50
  Tab Delimited (TSV)   2D SDfile   Computed 3D by Vconf -m prep SDfile
Find this compound or compounds like it in BindingDB:
Activity Spreadsheet -- Enzyme Inhibition Constant Data from BindingDB
Found 3 hits for monomerid = 74490
TargetTyrosine-protein phosphatase non-receptor type 22(Homo sapiens (Human))
Burnham Center For Chemical Genomics
Curated by PubChem BioAssay
LigandPNGBDBM74490(4-chloranyl-1-methyl-N-[1-[(2-methylphenyl)methyl]...)
Affinity DataIC50: >7.94E+4nM. Assay description: Data Source: Sanford-Burnham Center for Chemical Genomics (SBCCG) Source Affiliation: Sanford-Burnham Medical Research Institute (SBMRI, San Diego, ...
In DepthDetails PCBioAssay
TargetTyrosine-protein phosphatase non-receptor type 22(Homo sapiens (Human))
Burnham Center For Chemical Genomics
Curated by PubChem BioAssay
LigandPNGBDBM74490(4-chloranyl-1-methyl-N-[1-[(2-methylphenyl)methyl]...)
Affinity DataIC50: >7.94E+4nM. Assay description: Data Source: Sanford-Burnham Center for Chemical Genomics (SBCCG) Source Affiliation: Sanford-Burnham Medical Research Institute (SBMRI, San Diego, ...
In DepthDetails PCBioAssay
TargetTyrosine-protein phosphatase non-receptor type 7(Homo sapiens (Human))
Burnham Center For Chemical Genomics
Curated by PubChem BioAssay
LigandPNGBDBM74490(4-chloranyl-1-methyl-N-[1-[(2-methylphenyl)methyl]...)
Affinity DataIC50: >7.94E+4nM. Assay description: Data Source: Sanford-Burnham Center for Chemical Genomics (SBCCG) Source Affiliation: Sanford-Burnham Medical Research Institute (SBMRI, San Diego, C...
In DepthDetails PCBioAssay