BDBM74513 2-keto-6-methyl-1H-quinoline-4-carboxylic acid phenacyl ester::2-oxo-2-phenylethyl 2-hydroxy-6-methyl-4-quinolinecarboxylate::6-methyl-2-oxo-1H-quinoline-4-carboxylic acid phenacyl ester::MLS000705523::SMR000231125::cid_747118::phenacyl 6-methyl-2-oxidanylidene-1H-quinoline-4-carboxylate::phenacyl 6-methyl-2-oxo-1H-quinoline-4-carboxylate
SMILES Cc1ccc2[nH]c(=O)cc(C(=O)OCC(=O)c3ccccc3)c2c1
InChI Key InChIKey=QARVEKZNRWLUES-UHFFFAOYSA-N
Data  3 IC50
  Tab Delimited (TSV)   2D SDfile   Computed 3D by Vconf -m prep SDfile
Find this compound or compounds like it in BindingDB:
Activity Spreadsheet -- Enzyme Inhibition Constant Data from BindingDB
Found 3 hits for monomerid = 74513
TargetTyrosine-protein phosphatase non-receptor type 22(Homo sapiens (Human))
Burnham Center For Chemical Genomics
Curated by PubChem BioAssay
LigandPNGBDBM74513(2-keto-6-methyl-1H-quinoline-4-carboxylic acid phe...)
Affinity DataIC50: >7.94E+4nM. Assay description: Data Source: Sanford-Burnham Center for Chemical Genomics (SBCCG) Source Affiliation: Sanford-Burnham Medical Research Institute (SBMRI, San Diego, ...
In DepthDetails PCBioAssay
TargetTyrosine-protein phosphatase non-receptor type 22(Homo sapiens (Human))
Burnham Center For Chemical Genomics
Curated by PubChem BioAssay
LigandPNGBDBM74513(2-keto-6-methyl-1H-quinoline-4-carboxylic acid phe...)
Affinity DataIC50: >7.94E+4nM. Assay description: Data Source: Sanford-Burnham Center for Chemical Genomics (SBCCG) Source Affiliation: Sanford-Burnham Medical Research Institute (SBMRI, San Diego, ...
In DepthDetails PCBioAssay
TargetTyrosine-protein phosphatase non-receptor type 7(Homo sapiens (Human))
Burnham Center For Chemical Genomics
Curated by PubChem BioAssay
LigandPNGBDBM74513(2-keto-6-methyl-1H-quinoline-4-carboxylic acid phe...)
Affinity DataIC50: >7.94E+4nM. Assay description: Data Source: Sanford-Burnham Center for Chemical Genomics (SBCCG) Source Affiliation: Sanford-Burnham Medical Research Institute (SBMRI, San Diego, C...
In DepthDetails PCBioAssay