BDBM74540 MLS001101264::N-(2-mesyl-3,4-dihydro-1H-isoquinolin-7-yl)tetrahydrofuran-2-carboxamide::N-(2-methylsulfonyl-3,4-dihydro-1H-isoquinolin-7-yl)-2-oxolanecarboxamide::N-(2-methylsulfonyl-3,4-dihydro-1H-isoquinolin-7-yl)oxolane-2-carboxamide::SMR000665645::cid_24817352
SMILES CS(=O)(=O)N1CCc2ccc(NC(=O)C3CCCO3)cc2C1
InChI Key InChIKey=SNWHJLHRQAHINM-UHFFFAOYSA-N
Data  3 IC50
  Tab Delimited (TSV)   2D SDfile   Computed 3D by Vconf -m prep SDfile
Find this compound or compounds like it in BindingDB:
Activity Spreadsheet -- Enzyme Inhibition Constant Data from BindingDB
Found 3 hits for monomerid = 74540
TargetTyrosine-protein phosphatase non-receptor type 22(Homo sapiens (Human))
Burnham Center For Chemical Genomics
Curated by PubChem BioAssay
LigandPNGBDBM74540(MLS001101264 | N-(2-mesyl-3,4-dihydro-1H-isoquinol...)
Affinity DataIC50: >7.94E+4nM. Assay description: Data Source: Sanford-Burnham Center for Chemical Genomics (SBCCG) Source Affiliation: Sanford-Burnham Medical Research Institute (SBMRI, San Diego, ...
In DepthDetails PCBioAssay
TargetTyrosine-protein phosphatase non-receptor type 22(Homo sapiens (Human))
Burnham Center For Chemical Genomics
Curated by PubChem BioAssay
LigandPNGBDBM74540(MLS001101264 | N-(2-mesyl-3,4-dihydro-1H-isoquinol...)
Affinity DataIC50: >7.94E+4nM. Assay description: Data Source: Sanford-Burnham Center for Chemical Genomics (SBCCG) Source Affiliation: Sanford-Burnham Medical Research Institute (SBMRI, San Diego, ...
In DepthDetails PCBioAssay
TargetTyrosine-protein phosphatase non-receptor type 7(Homo sapiens (Human))
Burnham Center For Chemical Genomics
Curated by PubChem BioAssay
LigandPNGBDBM74540(MLS001101264 | N-(2-mesyl-3,4-dihydro-1H-isoquinol...)
Affinity DataIC50: >7.94E+4nM. Assay description: Data Source: Sanford-Burnham Center for Chemical Genomics (SBCCG) Source Affiliation: Sanford-Burnham Medical Research Institute (SBMRI, San Diego, C...
In DepthDetails PCBioAssay