BDBM74735 3-(4-chlorophenyl)sulfanyl-N-(3-propan-2-yloxypropyl)propanamide::3-[(4-chlorophenyl)thio]-N-(3-isopropoxypropyl)propanamide::3-[(4-chlorophenyl)thio]-N-(3-isopropoxypropyl)propionamide::3-[(4-chlorophenyl)thio]-N-(3-propan-2-yloxypropyl)propanamide::MLS000537842::SMR000144082::cid_2207240
SMILES CC(C)OCCCNC(=O)CCSc1ccc(Cl)cc1
InChI Key InChIKey=DUFVWAOQDVVBND-UHFFFAOYSA-N
Data  1 EC50
  Tab Delimited (TSV)   2D SDfile   Computed 3D by Vconf -m prep SDfile
Find this compound or compounds like it in BindingDB:
Activity Spreadsheet -- Enzyme Inhibition Constant Data from BindingDB
Found 1 hit for monomerid = 74735
TargetImportin subunit alpha-1(Homo sapiens (Human))
Broad Institute
Curated by PubChem BioAssay
LigandPNGBDBM74735(3-(4-chlorophenyl)sulfanyl-N-(3-propan-2-yloxyprop...)
Affinity DataEC50: >5.00E+5nM. Assay description: Keywords: Counterscreen, FRET assay, HTS, YIC probe, Dose response, Assay Overview: This is a fluorescence resonance energy transfer (FRET)-based b...
In DepthDetails PCBioAssay