BDBM75325 4-[(E)-[3-(2-hydroxy-2-oxoethyl)-4-oxidanylidene-2-sulfanylidene-1,3-thiazolidin-5-ylidene]methyl]benzoic acid::4-[(E)-[3-(carboxymethyl)-4-keto-2-thioxo-thiazolidin-5-ylidene]methyl]benzoic acid::4-[(E)-[3-(carboxymethyl)-4-oxo-2-sulfanylidene-1,3-thiazolidin-5-ylidene]methyl]benzoic acid::4-[(E)-[3-(carboxymethyl)-4-oxo-2-sulfanylidene-5-thiazolidinylidene]methyl]benzoic acid::MLS-0146312.0001::cid_1549794
SMILES OC(=O)CN1C(=S)S\C(=C\c2ccc(cc2)C(O)=O)C1=O
InChI Key InChIKey=RARMXMDEVBVFSN-WEVVVXLNSA-N
Data  3 IC50
  Tab Delimited (TSV)   2D SDfile   Computed 3D by Vconf -m prep SDfile
Find this compound or compounds like it in BindingDB:
Activity Spreadsheet -- Enzyme Inhibition Constant Data from BindingDB
Found 3 hits for monomerid = 75325
TargetTyrosine-protein phosphatase non-receptor type 22(Homo sapiens (Human))
Burnham Center For Chemical Genomics
Curated by PubChem BioAssay
LigandPNGBDBM75325(4-[(E)-[3-(2-hydroxy-2-oxoethyl)-4-oxidanylidene-2...)
Affinity DataIC50: >1.00E+5nM. Assay description: Data Source: Sanford-Burnham Center for Chemical Genomics (SBCCG) Source Affiliation: Sanford-Burnham Medical Research Institute (SBMRI, San Diego, C...
In DepthDetails PCBioAssay
TargetDNA (cytosine-5)-methyltransferase 3A(Homo sapiens (Human))
Burnham Center For Chemical Genomics
Curated by PubChem BioAssay
LigandPNGBDBM75325(4-[(E)-[3-(2-hydroxy-2-oxoethyl)-4-oxidanylidene-2...)
Affinity DataIC50:  2.45E+4nM. Assay description: Data Source: Sanford-Burnham Center for Chemical Genomics (SBCCG) Source Affiliation: Sanford-Burnham Medical Research Institute (SBMRI, San Diego, C...
In DepthDetails PCBioAssay
TargetTyrosine-protein phosphatase non-receptor type 22(Homo sapiens (Human))
Burnham Center For Chemical Genomics
Curated by PubChem BioAssay
LigandPNGBDBM75325(4-[(E)-[3-(2-hydroxy-2-oxoethyl)-4-oxidanylidene-2...)
Affinity DataIC50:  8.89E+4nM. Assay description: Data Source: Sanford-Burnham Center for Chemical Genomics (SBCCG) Source Affiliation: Sanford-Burnham Medical Research Institute(SBMRI, San Diego, CA...
In DepthDetails PCBioAssay