BDBM75340 3-[2-(4-fluorophenyl)-1,2,3,4-tetrazol-5-yl]-2-methoxy-pyridine::3-[2-(4-fluorophenyl)-5-tetrazolyl]-2-methoxypyridine::3-[2-(4-fluorophenyl)tetrazol-5-yl]-2-methoxy-pyridine::3-[2-(4-fluorophenyl)tetrazol-5-yl]-2-methoxypyridine::MLS-0067106.0001::cid_16066511
SMILES COc1ncccc1-c1nnn(n1)-c1ccc(F)cc1
InChI Key InChIKey=XSLZDEWMQYHBQJ-UHFFFAOYSA-N
Data  1 IC50
  Tab Delimited (TSV)   2D SDfile   Computed 3D by Vconf -m prep SDfile
Find this compound or compounds like it in BindingDB:
Activity Spreadsheet -- Enzyme Inhibition Constant Data from BindingDB
Found 1 hit for monomerid = 75340
TargetDual specificity protein phosphatase 3(Homo sapiens (Human))
Burnham Center For Chemical Genomics
Curated by PubChem BioAssay
LigandPNGBDBM75340(3-[2-(4-fluorophenyl)-1,2,3,4-tetrazol-5-yl]-2-met...)
Affinity DataIC50: >1.00E+5nM. Assay description: Data Source: Burnham Center for Chemical Genomics (BCCG) Source Affiliation: Sanford-Burnham Medical Research Institute (SBMRI, San Diego, CA) Networ...
In DepthDetails PCBioAssay