BDBM75360 4-amino-3-(3,4-dimethylphenyl)-N-(2-fluorophenyl)-2-sulfanylidene-1,3-thiazole-5-carboxamide::4-amino-3-(3,4-dimethylphenyl)-N-(2-fluorophenyl)-2-sulfanylidene-5-thiazolecarboxamide::4-amino-3-(3,4-dimethylphenyl)-N-(2-fluorophenyl)-2-thioxo-4-thiazoline-5-carboxamide::4-azanyl-3-(3,4-dimethylphenyl)-N-(2-fluorophenyl)-2-sulfanylidene-1,3-thiazole-5-carboxamide::MLS-0237142.0001::cid_4112347
SMILES Cc1ccc(cc1C)-n1c(N)c(sc1=S)C(=O)Nc1ccccc1F
InChI Key InChIKey=VNEBZIGPFRXJHY-UHFFFAOYSA-N
Data  2 IC50
  Tab Delimited (TSV)   2D SDfile   Computed 3D by Vconf -m prep SDfile
Find this compound or compounds like it in BindingDB:
Activity Spreadsheet -- Enzyme Inhibition Constant Data from BindingDB
Found 2 hits for monomerid = 75360
TargetTyrosine-protein phosphatase non-receptor type 7(Homo sapiens (Human))
Burnham Center For Chemical Genomics
Curated by PubChem BioAssay
LigandPNGBDBM75360(4-amino-3-(3,4-dimethylphenyl)-N-(2-fluorophenyl)-...)
Affinity DataIC50:  5.05E+4nM. Assay description: Data Source: Sanford-Burnham Center for Chemical Genomics (SBCCG) Source Affiliation: Sanford-Burnham Medical Research Institute (SBMRI, San Diego, C...
In DepthDetails PCBioAssay
TargetDual specificity protein phosphatase 3(Homo sapiens (Human))
Burnham Center For Chemical Genomics
Curated by PubChem BioAssay
LigandPNGBDBM75360(4-amino-3-(3,4-dimethylphenyl)-N-(2-fluorophenyl)-...)
Affinity DataIC50:  6.62E+4nM. Assay description: Data Source: Burnham Center for Chemical Genomics (BCCG) Source Affiliation: Sanford-Burnham Medical Research Institute (SBMRI, San Diego, CA) Networ...
In DepthDetails PCBioAssay