BDBM75481 1H-benzimidazol-2-yl-(veratrylideneamino)amine::MLS000562812::N-(1H-Benzoimidazol-2-yl)-N'-(3,4-dimethoxy-benzylidene)-hydrazine::N-[(3,4-dimethoxyphenyl)methylideneamino]-1H-benzimidazol-2-amine::SMR000175360::cid_3110998
SMILES COc1ccc(CN=Nc2nc3ccccc3[nH]2)cc1OC
InChI Key InChIKey=NHBBCAHXEMUWND-LVZFUZTISA-N
Data  2 EC50
  Tab Delimited (TSV)   2D SDfile   Computed 3D by Vconf -m prep SDfile
Find this compound or compounds like it in BindingDB:
Activity Spreadsheet -- Enzyme Inhibition Constant Data from BindingDB
Found 2 hits for monomerid = 75481
TargetAryl hydrocarbon receptor(Homo sapiens (Human))
The Scripps Research Institute Molecular Screening Center
Curated by PubChem BioAssay
LigandPNGBDBM75481(1H-benzimidazol-2-yl-(veratrylideneamino)amine | M...)
Affinity DataEC50:  3.46E+3nM. Assay description: Source (MLPCN Center Name): The Scripps Research Institute Molecular Screening Center (SRIMSC) Center Affiliation: The Scripps Research Institute (TS...
In DepthDetails PCBioAssay
TargetNuclear receptor subfamily 1 group I member 2(Homo sapiens (Human))
The Scripps Research Institute Molecular Screening Center
Curated by PubChem BioAssay
LigandPNGBDBM75481(1H-benzimidazol-2-yl-(veratrylideneamino)amine | M...)
Affinity DataEC50:  6.73E+4nM. Assay description: Source (MLPCN Center Name): The Scripps Research Institute Molecular Screening Center (SRIMSC) Center Affiliation: The Scripps Research Institute (TS...
In DepthDetails PCBioAssay