BDBM75494 MLS000700056::N-(2,4-dimethoxyphenyl)-4-methyl-benzamide::N-(2,4-dimethoxyphenyl)-4-methylbenzamide::SMR000227551::cid_710605
SMILES COc1ccc(NC(=O)c2ccc(C)cc2)c(OC)c1
InChI Key InChIKey=AGWCBNJDPXUGEN-UHFFFAOYSA-N
Data  2 EC50
  Tab Delimited (TSV)   2D SDfile   Computed 3D by Vconf -m prep SDfile
Find this compound or compounds like it in BindingDB:
Activity Spreadsheet -- Enzyme Inhibition Constant Data from BindingDB
Found 2 hits for monomerid = 75494
TargetAryl hydrocarbon receptor(Homo sapiens (Human))
The Scripps Research Institute Molecular Screening Center
Curated by PubChem BioAssay
LigandPNGBDBM75494(MLS000700056 | N-(2,4-dimethoxyphenyl)-4-methyl-be...)
Affinity DataEC50:  3.78E+3nM. Assay description: Source (MLPCN Center Name): The Scripps Research Institute Molecular Screening Center (SRIMSC) Center Affiliation: The Scripps Research Institute (TS...
In DepthDetails PCBioAssay
TargetNuclear receptor subfamily 1 group I member 2(Homo sapiens (Human))
The Scripps Research Institute Molecular Screening Center
Curated by PubChem BioAssay
LigandPNGBDBM75494(MLS000700056 | N-(2,4-dimethoxyphenyl)-4-methyl-be...)
Affinity DataEC50: >1.16E+5nM. Assay description: Source (MLPCN Center Name): The Scripps Research Institute Molecular Screening Center (SRIMSC) Center Affiliation: The Scripps Research Institute (TS...
In DepthDetails PCBioAssay