BDBM75536 MLS002249107::N'-[3-chloranyl-5-(trifluoromethyl)pyridin-2-yl]-2,4-bis(fluoranyl)benzenesulfonohydrazide::N'-[3-chloro-5-(trifluoromethyl)-2-pyridinyl]-2,4-difluorobenzenesulfonohydrazide::N'-[3-chloro-5-(trifluoromethyl)-2-pyridyl]-2,4-difluoro-benzenesulfonohydrazide::N'-[3-chloro-5-(trifluoromethyl)pyridin-2-yl]-2,4-difluorobenzenesulfonohydrazide::SMR001316556::cid_4851243
SMILES Fc1ccc(c(F)c1)S(=O)(=O)NNc1ncc(cc1Cl)C(F)(F)F
InChI Key InChIKey=QMYHGWDJTXAPOF-UHFFFAOYSA-N
Data  2 EC50
  Tab Delimited (TSV)   2D SDfile   Computed 3D by Vconf -m prep SDfile
Find this compound or compounds like it in BindingDB:
Activity Spreadsheet -- Enzyme Inhibition Constant Data from BindingDB
Found 2 hits for monomerid = 75536
TargetAryl hydrocarbon receptor(Homo sapiens (Human))
The Scripps Research Institute Molecular Screening Center
Curated by PubChem BioAssay
LigandPNGBDBM75536(MLS002249107 | N'-[3-chloranyl-5-(trifluoromethyl)...)
Affinity DataEC50:  3.38E+3nM. Assay description: Source (MLPCN Center Name): The Scripps Research Institute Molecular Screening Center (SRIMSC) Center Affiliation: The Scripps Research Institute (TS...
In DepthDetails PCBioAssay
TargetNuclear receptor subfamily 1 group I member 2(Homo sapiens (Human))
The Scripps Research Institute Molecular Screening Center
Curated by PubChem BioAssay
LigandPNGBDBM75536(MLS002249107 | N'-[3-chloranyl-5-(trifluoromethyl)...)
Affinity DataEC50: >1.16E+5nM. Assay description: Source (MLPCN Center Name): The Scripps Research Institute Molecular Screening Center (SRIMSC) Center Affiliation: The Scripps Research Institute (TS...
In DepthDetails PCBioAssay