BDBM75542 MLS000578435::N-(4-{[(4-fluorophenyl)amino]sulfonyl}phenyl)-2-methoxy-2-phenylacetamide::N-[4-[(4-fluorophenyl)sulfamoyl]phenyl]-2-methoxy-2-phenyl-acetamide::N-[4-[(4-fluorophenyl)sulfamoyl]phenyl]-2-methoxy-2-phenyl-ethanamide::N-[4-[(4-fluorophenyl)sulfamoyl]phenyl]-2-methoxy-2-phenylacetamide::SMR000198437::cid_2940387
SMILES COC(C(=O)Nc1ccc(cc1)S(=O)(=O)Nc1ccc(F)cc1)c1ccccc1
InChI Key InChIKey=JAKNCMIJNJQYJS-UHFFFAOYSA-N
Data  2 EC50
  Tab Delimited (TSV)   2D SDfile   Computed 3D by Vconf -m prep SDfile
Find this compound or compounds like it in BindingDB:
Activity Spreadsheet -- Enzyme Inhibition Constant Data from BindingDB
Found 2 hits for monomerid = 75542
TargetVasopressin V1a receptor(Homo sapiens (Human))
The Scripps Research Institute Molecular Screening Center
Curated by PubChem BioAssay
LigandPNGBDBM75542(MLS000578435 | N-(4-{[(4-fluorophenyl)amino]sulfon...)
Affinity DataEC50: >2.99E+4nM. Assay description: Source (MLPCN Center Name): The Scripps Research Institute Molecular Screening Center (SRIMSC) Center Affiliation: The Scripps Research Institute (TS...
In DepthDetails PCBioAssay
TargetOxytocin receptor(Homo sapiens (Human))
The Scripps Research Institute Molecular Screening Center
Curated by PubChem BioAssay
LigandPNGBDBM75542(MLS000578435 | N-(4-{[(4-fluorophenyl)amino]sulfon...)
Affinity DataEC50: >2.99E+4nM. Assay description: Source (MLPCN Center Name): The Scripps Research Institute Molecular Screening Center (SRIMSC) Center Affiliation: The Scripps Research Institute (TS...
In DepthDetails PCBioAssay