BDBM75555 4-[[(2-methylphenyl)sulfonylamino]methyl]-N-[2-[(phenylmethyl)-propan-2-yl-amino]ethyl]benzamide::4-[[(2-methylphenyl)sulfonylamino]methyl]-N-[2-[(phenylmethyl)-propan-2-ylamino]ethyl]benzamide::KSC-11-74-1::KUC104612N::N-[2-[benzyl(isopropyl)amino]ethyl]-4-[(o-tolylsulfonylamino)methyl]benzamide::N-[2-[benzyl(propan-2-yl)amino]ethyl]-4-[[(2-methylphenyl)sulfonylamino]methyl]benzamide::cid_44968274
SMILES CC(C)N(CCNC(=O)c1ccc(CNS(=O)(=O)c2ccccc2C)cc1)Cc1ccccc1
InChI Key InChIKey=XRYQHWCMOMEZGF-UHFFFAOYSA-N
Data  2 IC50
  Tab Delimited (TSV)   2D SDfile   Computed 3D by Vconf -m prep SDfile
Find this compound or compounds like it in BindingDB:
Activity Spreadsheet -- Enzyme Inhibition Constant Data from BindingDB
Found 2 hits for monomerid = 75555
TargetKappa-type opioid receptor(Homo sapiens (Human))
Burnham Center For Chemical Genomics
Curated by PubChem BioAssay
LigandPNGBDBM75555(4-[[(2-methylphenyl)sulfonylamino]methyl]-N-[2-[(p...)
Affinity DataIC50:  2.34E+3nM. Assay description: Data Source: Sanford-Burnham Center for Chemical Genomics (SBCCG) Source Affiliation: Sanford-Burnham Medical Research Institute (SBMRI, San Diego, C...
In DepthDetails PCBioAssay
TargetKappa-type opioid receptor(Homo sapiens (Human))
Burnham Center For Chemical Genomics
Curated by PubChem BioAssay
LigandPNGBDBM75555(4-[[(2-methylphenyl)sulfonylamino]methyl]-N-[2-[(p...)
Affinity DataIC50:  2.49E+3nM. Assay description: Data Source: Burnham Center for Chemical Genomics (BCCG) Source Affiliation: Burnham Institute for Medical Research (BIMR, La Jolla, CA) Network: NIH...
In DepthDetails PCBioAssay