BDBM75582 4-[[(4-methylphenyl)sulfonylamino]methyl]-N-[2-(4-phenyl-1-piperazinyl)ethyl]benzamide::4-[[(4-methylphenyl)sulfonylamino]methyl]-N-[2-(4-phenylpiperazin-1-yl)ethyl]benzamide::KSC-11-168-1::KUC105603N::N-[2-(4-phenylpiperazino)ethyl]-4-[(tosylamino)methyl]benzamide::cid_6621922
SMILES Cc1ccc(cc1)S(=O)(=O)NCc1ccc(cc1)C(=O)NCCN1CCN(CC1)c1ccccc1
InChI Key InChIKey=HALMNKNJZDZIBI-UHFFFAOYSA-N
Data  5 IC50
  Tab Delimited (TSV)   2D SDfile   Computed 3D by Vconf -m prep SDfile
Find this compound or compounds like it in BindingDB:
Activity Spreadsheet -- Enzyme Inhibition Constant Data from BindingDB
Found 5 hits for monomerid = 75582
TargetKappa-type opioid receptor(Homo sapiens (Human))
Burnham Center For Chemical Genomics
Curated by PubChem BioAssay
LigandPNGBDBM75582(4-[[(4-methylphenyl)sulfonylamino]methyl]-N-[2-(4-...)
Affinity DataIC50:  2.00E+4nM. Assay description: Data Source: Burnham Center for Chemical Genomics (BCCG) Source Affiliation: Burnham Institute for Medical Research (BIMR, La Jolla, CA) Network: NIH...
In DepthDetails PCBioAssay
TargetKappa-type opioid receptor(Homo sapiens (Human))
Burnham Center For Chemical Genomics
Curated by PubChem BioAssay
LigandPNGBDBM75582(4-[[(4-methylphenyl)sulfonylamino]methyl]-N-[2-(4-...)
Affinity DataIC50: >3.20E+4nM. Assay description: Data Source: Sanford-Burnham Center for Chemical Genomics (SBCCG) Source Affiliation: Sanford-Burnham Medical Research Institute (SBMRI, San Diego, C...
In DepthDetails PCBioAssay
TargetMu-type opioid receptor(Homo sapiens (Human))
Burnham Center For Chemical Genomics
Curated by PubChem BioAssay
LigandPNGBDBM75582(4-[[(4-methylphenyl)sulfonylamino]methyl]-N-[2-(4-...)
Affinity DataIC50: >3.20E+4nM. Assay description: Data Source: Sanford-Burnham Center for Chemical Genomics (SBCCG) Source Affiliation: Sanford-Burnham Medical Research Institute (SBMRI, San Diego, C...
In DepthDetails PCBioAssay
TargetDelta-type opioid receptor(Homo sapiens (Human))
Burnham Center For Chemical Genomics
Curated by PubChem BioAssay
LigandPNGBDBM75582(4-[[(4-methylphenyl)sulfonylamino]methyl]-N-[2-(4-...)
Affinity DataIC50: >3.20E+4nM. Assay description: Data Source: Sanford-Burnham Center for Chemical Genomics (SBCCG) Source Affiliation: Sanford-Burnham Medical Research Institute (SBMRI, San Diego, C...
In DepthDetails PCBioAssay
TargetKappa-type opioid receptor(Homo sapiens (Human))
Burnham Center For Chemical Genomics
Curated by PubChem BioAssay
LigandPNGBDBM75582(4-[[(4-methylphenyl)sulfonylamino]methyl]-N-[2-(4-...)
Affinity DataIC50: >2.00E+4nM. Assay description: Data Source: Sanford-Burnham Center for Chemical Genomics (SBCCG) Source Affiliation: Sanford-Burnham Medical Research Institute (SBMRI, San Diego, C...
In DepthDetails PCBioAssay