BDBM75653 3-(4-Methoxy-benzyl)-1-p-tolyl-pyrrolidine-2,5-dione::3-[(4-methoxyphenyl)methyl]-1-(4-methylphenyl)pyrrolidine-2,5-dione::3-p-anisyl-1-(p-tolyl)pyrrolidine-2,5-quinone::MLS001205902::SMR000515524::cid_3120359
SMILES COc1ccc(Cc2cc(O)n(c2O)-c2ccc(C)cc2)cc1
InChI Key InChIKey=BUQFBQLWPBECRS-UHFFFAOYSA-N
Data  1 IC50  1 EC50
  Tab Delimited (TSV)   2D SDfile   Computed 3D by Vconf -m prep SDfile
Find this compound or compounds like it in BindingDB:
Activity Spreadsheet -- Enzyme Inhibition Constant Data from BindingDB
Found 2 hits for monomerid = 75653
TargetIntestinal-type alkaline phosphatase(Homo sapiens (Human))
Burnham Center For Chemical Genomics
Curated by PubChem BioAssay
LigandPNGBDBM75653(3-(4-Methoxy-benzyl)-1-p-tolyl-pyrrolidine-2,5-dio...)
Affinity DataIC50: >1.00E+5nM. Assay description: Data Source: Sanford-Burnham Center for Chemical Genomics (SBCCG) Source Affiliation: Sanford-Burnham Medical Research Institute (SBMRI, San Diego, C...
Ligand InfoPC cidPC sid
In DepthDetails PCBioAssay
TargetIntestinal-type alkaline phosphatase(Homo sapiens (Human))
Burnham Center For Chemical Genomics
Curated by PubChem BioAssay
LigandPNGBDBM75653(3-(4-Methoxy-benzyl)-1-p-tolyl-pyrrolidine-2,5-dio...)
Affinity DataEC50: >1.00E+5nM. Assay description: Data Source: Sanford-Burnham Center for Chemical Genomics (SBCCG) Source Affiliation: Sanford-Burnham Medical Research Institute (SBMRI, San Diego, C...
Ligand InfoPC cidPC sid
In DepthDetails PCBioAssay