BDBM75797 MLS000576177::N-[2,4-bis(chloranyl)-5-[[(E)-(2-oxidanyl-4-oxidanylidene-cyclohexa-2,5-dien-1-ylidene)methyl]amino]phenyl]ethanamide::N-[2,4-dichloro-5-[[(E)-(2-hydroxy-4-keto-cyclohexa-2,5-dien-1-ylidene)methyl]amino]phenyl]acetamide::N-[2,4-dichloro-5-[[(E)-(2-hydroxy-4-oxo-1-cyclohexa-2,5-dienylidene)methyl]amino]phenyl]acetamide::N-[2,4-dichloro-5-[[(E)-(2-hydroxy-4-oxocyclohexa-2,5-dien-1-ylidene)methyl]amino]phenyl]acetamide::N-{2,4-dichloro-5-[(2,4-dihydroxybenzylidene)amino]phenyl}acetamide::SMR000185203::cid_5407113
SMILES CC(=O)Nc1cc(N=Cc2ccc(O)cc2O)c(Cl)cc1Cl
InChI Key InChIKey=FHOUBXSESZDGTK-UHFFFAOYSA-N
Data  1 IC50
  Tab Delimited (TSV)   2D SDfile   Computed 3D by Vconf -m prep SDfile
Find this compound or compounds like it in BindingDB:
Activity Spreadsheet -- Enzyme Inhibition Constant Data from BindingDB
Found 1 hit for monomerid = 75797
TargetInsulin-degrading enzyme(Homo sapiens (Human))
The Scripps Research Institute Molecular Screening Center
Curated by PubChem BioAssay
LigandPNGBDBM75797(MLS000576177 | N-[2,4-bis(chloranyl)-5-[[(E)-(2-ox...)
Affinity DataIC50: >6.22E+3nM. Assay description: Source (MLPCN Center Name): The Scripps Research Institute Molecular Screening Center (SRIMSC) Center Affiliation: The Scripps Research Institute (TS...
In DepthDetails PCBioAssay