BDBM75815 (5Z)-5-(4-morpholin-4-ylbenzylidene)-3-propyl-2-thioxoimidazolidin-4-one::(5Z)-5-(4-morpholinobenzylidene)-3-propyl-2-thioxo-4-imidazolidinone::(5Z)-5-[(4-morpholin-4-ylphenyl)methylidene]-3-propyl-2-sulfanylidene-imidazolidin-4-one::(5Z)-5-[(4-morpholin-4-ylphenyl)methylidene]-3-propyl-2-sulfanylideneimidazolidin-4-one::(5Z)-5-[[4-(4-morpholinyl)phenyl]methylidene]-3-propyl-2-sulfanylidene-4-imidazolidinone::MLS000727490::SMR000306187::cid_6393134
SMILES CCCN1C(=S)N\C(=C/c2ccc(cc2)N2CCOCC2)C1=O
InChI Key InChIKey=VYUKSSUYFSJQQK-QINSGFPZSA-N
Data  1 IC50
  Tab Delimited (TSV)   2D SDfile   Computed 3D by Vconf -m prep SDfile
Find this compound or compounds like it in BindingDB:
Activity Spreadsheet -- Enzyme Inhibition Constant Data from BindingDB
Found 1 hit for monomerid = 75815
TargetInsulin-degrading enzyme(Homo sapiens (Human))
The Scripps Research Institute Molecular Screening Center
Curated by PubChem BioAssay
LigandPNGBDBM75815((5Z)-5-(4-morpholin-4-ylbenzylidene)-3-propyl-2-th...)
Affinity DataIC50:  3.31E+4nM. Assay description: Source (MLPCN Center Name): The Scripps Research Institute Molecular Screening Center (SRIMSC) Center Affiliation: The Scripps Research Institute (TS...
In DepthDetails PCBioAssay