BDBM75818 (E)-2-cyano-3-(5-morpholin-4-ylfuran-2-yl)-N-(oxolan-2-ylmethyl)prop-2-enamide::(E)-2-cyano-3-(5-morpholino-2-furyl)-N-(tetrahydrofurfuryl)acrylamide::(E)-2-cyano-3-[5-(4-morpholinyl)-2-furanyl]-N-(2-oxolanylmethyl)-2-propenamide::MLS000687813::SMR000284872::cid_5344735
SMILES O=C(NCC1CCCO1)C(=C\c1ccc(o1)N1CCOCC1)\C#N
InChI Key InChIKey=JLNNUDJPLDUYQM-JLHYYAGUSA-N
Data  3 IC50
  Tab Delimited (TSV)   2D SDfile   Computed 3D by Vconf -m prep SDfile
Find this compound or compounds like it in BindingDB:
Activity Spreadsheet -- Enzyme Inhibition Constant Data from BindingDB
Found 3 hits for monomerid = 75818
TargetInsulin-degrading enzyme(Homo sapiens (Human))
The Scripps Research Institute Molecular Screening Center
Curated by PubChem BioAssay
LigandPNGBDBM75818((E)-2-cyano-3-(5-morpholin-4-ylfuran-2-yl)-N-(oxol...)
Affinity DataIC50:  2.53E+4nM. Assay description: Source (MLPCN Center Name): The Scripps Research Institute Molecular Screening Center (SRIMSC) Center Affiliation: The Scripps Research Institute (TS...
In DepthDetails PCBioAssay
TargetNuclear hormone receptor family member daf-12(Caenorhabditis elegans)
The Scripps Research Institute Molecular Screening Center
Curated by PubChem BioAssay
LigandPNGBDBM75818((E)-2-cyano-3-(5-morpholin-4-ylfuran-2-yl)-N-(oxol...)
Affinity DataIC50:  6.75E+4nM. Assay description: Source (MLPCN Center Name): The Scripps Research Institute Molecular Screening Center Affiliation: UT Southwestern Assay Provider: David Mangelsdorf,...
In DepthDetails PCBioAssay
TargetOxysterols receptor LXR-beta(Homo sapiens (Human))
The Scripps Research Institute Molecular Screening Center
Curated by PubChem BioAssay
LigandPNGBDBM75818((E)-2-cyano-3-(5-morpholin-4-ylfuran-2-yl)-N-(oxol...)
Affinity DataIC50:  6.75E+4nM. Assay description: Source (MLPCN Center Name): The Scripps Research Institute Molecular Screening Center Affiliation: UT Southwestern Assay Provider: David Mangelsdorf,...
In DepthDetails PCBioAssay