BDBM75825 3-[4-[(Z)-(3-ethyl-1,3-benzothiazol-2-ylidene)methyl]-1-quinolin-1-iumyl]-1-propanesulfonate::3-[4-[(Z)-(3-ethyl-1,3-benzothiazol-2-ylidene)methyl]quinolin-1-ium-1-yl]propane-1-sulfonate::MLS000693189::SMR000284619::cid_5767632
SMILES CCN1\C(Sc2ccccc12)=C\c1cc[n+](CCCS([O-])(=O)=O)c2ccccc12
InChI Key InChIKey=NWFOOWBBBGNCKO-UHFFFAOYSA-N
Data  3 IC50
  Tab Delimited (TSV)   2D SDfile   Computed 3D by Vconf -m prep SDfile
Find this compound or compounds like it in BindingDB:
Activity Spreadsheet -- Enzyme Inhibition Constant Data from BindingDB
Found 3 hits for monomerid = 75825
TargetInsulin-degrading enzyme(Homo sapiens (Human))
The Scripps Research Institute Molecular Screening Center
Curated by PubChem BioAssay
LigandPNGBDBM75825(3-[4-[(Z)-(3-ethyl-1,3-benzothiazol-2-ylidene)meth...)
Affinity DataIC50:  1.23E+4nM. Assay description: Source (MLPCN Center Name): The Scripps Research Institute Molecular Screening Center (SRIMSC) Center Affiliation: The Scripps Research Institute (TS...
Ligand InfoKEGGPC cidPC sid
In DepthDetails PCBioAssay
TargetDNA dC->dU-editing enzyme APOBEC-3G(Homo sapiens (Human))
Burnham Center For Chemical Genomics
Curated by PubChem BioAssay
LigandPNGBDBM75825(3-[4-[(Z)-(3-ethyl-1,3-benzothiazol-2-ylidene)meth...)
Affinity DataIC50:  2.97E+3nMT: 2°C. Assay description: Data Source: Sanford-Burnham Center for Chemical Genomics (SBCCG) Source Affiliation: Sanford-Burnham Medical Research Institute (SBMRI, San Diego, C...
Ligand InfoKEGGPC cidPC sid
In DepthDetails PCBioAssay
TargetDNA dC->dU-editing enzyme APOBEC-3A(Homo sapiens (Human))
Burnham Center For Chemical Genomics
Curated by PubChem BioAssay
LigandPNGBDBM75825(3-[4-[(Z)-(3-ethyl-1,3-benzothiazol-2-ylidene)meth...)
Affinity DataIC50:  2.69E+3nMT: 2°C. Assay description: Data Source: Sanford-Burnham Center for Chemical Genomics (SBCCG) Source Affiliation: Sanford-Burnham Medical Research Institute (SBMRI, San Diego, C...
Ligand InfoKEGGPC cidPC sid
In DepthDetails PCBioAssay