BDBM75882 5-chloranyl-4-(4-fluoranyl-2-methyl-phenoxy)-2-(4-methylphenyl)pyridazin-3-one::5-chloro-4-(4-fluoro-2-methyl-phenoxy)-2-(p-tolyl)pyridazin-3-one::5-chloro-4-(4-fluoro-2-methylphenoxy)-2-(4-methylphenyl)-3-pyridazinone::5-chloro-4-(4-fluoro-2-methylphenoxy)-2-(4-methylphenyl)pyridazin-3-one::SR-02000000350::SR-02000000350-1::cid_46172940
SMILES Cc1ccc(cc1)-n1ncc(Cl)c(Oc2ccc(F)cc2C)c1=O
InChI Key InChIKey=KJHQVBSAZUFFEK-UHFFFAOYSA-N
Data  2 IC50
  Tab Delimited (TSV)   2D SDfile   Computed 3D by Vconf -m prep SDfile
Find this compound or compounds like it in BindingDB:
Activity Spreadsheet -- Enzyme Inhibition Constant Data from BindingDB
Found 2 hits for monomerid = 75882
TargetNeuropeptides B/W receptor type 1(Homo sapiens (Human))
The Scripps Research Institute Molecular Screening Center
Curated by PubChem BioAssay
LigandPNGBDBM75882(5-chloranyl-4-(4-fluoranyl-2-methyl-phenoxy)-2-(4-...)
Affinity DataIC50:  1.00E+4nM. Assay description: Source (MLPCN Center Name): The Scripps Research Institute Molecular Screening Center (SRIMSC) Affiliation: The Scripps Research Institute, TSRI Assa...
In DepthDetails PCBioAssay
TargetMelanin-concentrating hormone receptor 1(Homo sapiens (Human))
The Scripps Research Institute Molecular Screening Center
Curated by PubChem BioAssay
LigandPNGBDBM75882(5-chloranyl-4-(4-fluoranyl-2-methyl-phenoxy)-2-(4-...)
Affinity DataIC50:  1.70E+4nM. Assay description: Source (MLPCN Center Name): The Scripps Research Institute Molecular Screening Center (SRIMSC) Affiliation: The Scripps Research Institute, TSRI Assa...
In DepthDetails PCBioAssay