BDBM75884 5-chloranyl-2-(4-methylphenyl)-4-[4-(trifluoromethyloxy)phenoxy]pyridazin-3-one::5-chloro-2-(4-methylphenyl)-4-[4-(trifluoromethoxy)phenoxy]-3-pyridazinone::5-chloro-2-(4-methylphenyl)-4-[4-(trifluoromethoxy)phenoxy]pyridazin-3-one::5-chloro-2-(p-tolyl)-4-[4-(trifluoromethoxy)phenoxy]pyridazin-3-one::SR-02000000352::SR-02000000352-1::cid_46172934
SMILES Cc1ccc(cc1)-n1ncc(Cl)c(Oc2ccc(OC(F)(F)F)cc2)c1=O
InChI Key InChIKey=RUOGXYMDRVZUKG-UHFFFAOYSA-N
Data  3 IC50
  Tab Delimited (TSV)   2D SDfile   Computed 3D by Vconf -m prep SDfile
Find this compound or compounds like it in BindingDB:
Activity Spreadsheet -- Enzyme Inhibition Constant Data from BindingDB
Found 3 hits for monomerid = 75884
TargetMelanin-concentrating hormone receptor 1(Homo sapiens (Human))
The Scripps Research Institute Molecular Screening Center
Curated by PubChem BioAssay
LigandPNGBDBM75884(5-chloranyl-2-(4-methylphenyl)-4-[4-(trifluorometh...)
Affinity DataIC50:  2.90E+3nM. Assay description: Source (MLPCN Center Name): The Scripps Research Institute Molecular Screening Center (SRIMSC) Affiliation: The Scripps Research Institute, TSRI Assa...
In DepthDetails PCBioAssay
TargetNeuropeptides B/W receptor type 1(Homo sapiens (Human))
The Scripps Research Institute
Curated by ChEMBL
LigandPNGBDBM75884(5-chloranyl-2-(4-methylphenyl)-4-[4-(trifluorometh...)
Affinity DataIC50:  2.20E+3nM. Assay description: Antagonist activity at human NPBWR1 expressed in HEK293T cells co-expressing Galphaqi3 assessed as calcium release after 15 mins by FLIPR assay assay
In DepthDetails ArticlePubMed
TargetNeuropeptides B/W receptor type 1(Homo sapiens (Human))
The Scripps Research Institute
Curated by ChEMBL
LigandPNGBDBM75884(5-chloranyl-2-(4-methylphenyl)-4-[4-(trifluorometh...)
Affinity DataIC50:  880nM. Assay description: Source (MLPCN Center Name): The Scripps Research Institute Molecular Screening Center (SRIMSC) Affiliation: The Scripps Research Institute, TSRI Assa...
In DepthDetails PCBioAssay