BDBM75897 5-chloranyl-2-(4-cyclopropylphenyl)-4-(4-methoxyphenoxy)pyridazin-3-one::5-chloro-2-(4-cyclopropylphenyl)-4-(4-methoxyphenoxy)-3-pyridazinone::5-chloro-2-(4-cyclopropylphenyl)-4-(4-methoxyphenoxy)pyridazin-3-one::SR-02000000368::SR-02000000368-1::cid_46172936
SMILES COc1ccc(Oc2c(Cl)cnn(-c3ccc(cc3)C3CC3)c2=O)cc1
InChI Key InChIKey=HPTGCJTXJCOTKX-UHFFFAOYSA-N
Data  3 IC50
  Tab Delimited (TSV)   2D SDfile   Computed 3D by Vconf -m prep SDfile
Find this compound or compounds like it in BindingDB:
Activity Spreadsheet -- Enzyme Inhibition Constant Data from BindingDB
Found 3 hits for monomerid = 75897
TargetMelanin-concentrating hormone receptor 1(Homo sapiens (Human))
The Scripps Research Institute Molecular Screening Center
Curated by PubChem BioAssay
LigandPNGBDBM75897(5-chloranyl-2-(4-cyclopropylphenyl)-4-(4-methoxyph...)
Affinity DataIC50:  6.80E+3nM. Assay description: Source (MLPCN Center Name): The Scripps Research Institute Molecular Screening Center (SRIMSC) Affiliation: The Scripps Research Institute, TSRI Assa...
In DepthDetails PCBioAssay
TargetNeuropeptides B/W receptor type 1(Homo sapiens (Human))
The Scripps Research Institute
Curated by ChEMBL
LigandPNGBDBM75897(5-chloranyl-2-(4-cyclopropylphenyl)-4-(4-methoxyph...)
Affinity DataIC50:  1.10E+3nM. Assay description: Antagonist activity at human NPBWR1 expressed in HEK293T cells co-expressing Galphaqi3 assessed as calcium release after 15 mins by FLIPR assay assay
In DepthDetails ArticlePubMed
TargetNeuropeptides B/W receptor type 1(Homo sapiens (Human))
The Scripps Research Institute
Curated by ChEMBL
LigandPNGBDBM75897(5-chloranyl-2-(4-cyclopropylphenyl)-4-(4-methoxyph...)
Affinity DataIC50:  1.10E+3nM. Assay description: Source (MLPCN Center Name): The Scripps Research Institute Molecular Screening Center (SRIMSC) Affiliation: The Scripps Research Institute, TSRI Assa...
In DepthDetails PCBioAssay