BDBM75912 5-(4-methoxyphenoxy)-6-oxidanylidene-1-(4-propan-2-ylphenyl)pyridazine-4-carbaldehyde::5-(4-methoxyphenoxy)-6-oxo-1-(4-propan-2-ylphenyl)-4-pyridazinecarboxaldehyde::5-(4-methoxyphenoxy)-6-oxo-1-(4-propan-2-ylphenyl)pyridazine-4-carbaldehyde::6-keto-5-(4-methoxyphenoxy)-1-p-cumenyl-pyridazine-4-carbaldehyde::SR-02000000441::SR-02000000441-1::cid_46835810
SMILES COc1ccc(Oc2c(C=O)cnn(-c3ccc(cc3)C(C)C)c2=O)cc1
InChI Key InChIKey=QYTUKOZJHJPHBG-UHFFFAOYSA-N
Data  3 IC50
  Tab Delimited (TSV)   2D SDfile   Computed 3D by Vconf -m prep SDfile
Find this compound or compounds like it in BindingDB:
Activity Spreadsheet -- Enzyme Inhibition Constant Data from BindingDB
Found 3 hits for monomerid = 75912
TargetMelanin-concentrating hormone receptor 1(Homo sapiens (Human))
The Scripps Research Institute Molecular Screening Center
Curated by PubChem BioAssay
LigandPNGBDBM75912(5-(4-methoxyphenoxy)-6-oxidanylidene-1-(4-propan-2...)
Affinity DataIC50:  4.80E+3nM. Assay description: Source (MLPCN Center Name): The Scripps Research Institute Molecular Screening Center (SRIMSC) Affiliation: The Scripps Research Institute, TSRI Assa...
In DepthDetails PCBioAssay
TargetNeuropeptides B/W receptor type 1(Homo sapiens (Human))
The Scripps Research Institute
Curated by ChEMBL
LigandPNGBDBM75912(5-(4-methoxyphenoxy)-6-oxidanylidene-1-(4-propan-2...)
Affinity DataIC50:  6.20E+3nM. Assay description: Antagonist activity at human NPBWR1 expressed in HEK293T cells co-expressing Galphaqi3 assessed as calcium release after 15 mins by FLIPR assay assay
In DepthDetails ArticlePubMed
TargetNeuropeptides B/W receptor type 1(Homo sapiens (Human))
The Scripps Research Institute
Curated by ChEMBL
LigandPNGBDBM75912(5-(4-methoxyphenoxy)-6-oxidanylidene-1-(4-propan-2...)
Affinity DataIC50:  6.20E+3nM. Assay description: Source (MLPCN Center Name): The Scripps Research Institute Molecular Screening Center (SRIMSC) Affiliation: The Scripps Research Institute, TSRI Assa...
In DepthDetails PCBioAssay