BDBM75914 4-(benzylamino)-5-chloro-2-(4-propan-2-ylphenyl)pyridazin-3-one::4-(benzylamino)-5-chloro-2-p-cumenyl-pyridazin-3-one::5-chloranyl-4-[(phenylmethyl)amino]-2-(4-propan-2-ylphenyl)pyridazin-3-one::5-chloro-4-[(phenylmethyl)amino]-2-(4-propan-2-ylphenyl)-3-pyridazinone::SR-02000000443::SR-02000000443-1::cid_46835807
SMILES CC(C)c1ccc(cc1)-n1ncc(Cl)c(NCc2ccccc2)c1=O
InChI Key InChIKey=BUBKAZGCPPCWCH-UHFFFAOYSA-N
Data  2 IC50
  Tab Delimited (TSV)   2D SDfile   Computed 3D by Vconf -m prep SDfile
Find this compound or compounds like it in BindingDB:
Activity Spreadsheet -- Enzyme Inhibition Constant Data from BindingDB
Found 2 hits for monomerid = 75914
TargetNeuropeptides B/W receptor type 1(Homo sapiens (Human))
The Scripps Research Institute Molecular Screening Center
Curated by PubChem BioAssay
LigandPNGBDBM75914(4-(benzylamino)-5-chloro-2-(4-propan-2-ylphenyl)py...)
Affinity DataIC50:  1.62E+4nM. Assay description: Source (MLPCN Center Name): The Scripps Research Institute Molecular Screening Center (SRIMSC) Affiliation: The Scripps Research Institute, TSRI Assa...
Ligand InfoPC cidPC sid
In DepthDetails PCBioAssay
TargetMelanin-concentrating hormone receptor 1(Homo sapiens (Human))
The Scripps Research Institute Molecular Screening Center
Curated by PubChem BioAssay
LigandPNGBDBM75914(4-(benzylamino)-5-chloro-2-(4-propan-2-ylphenyl)py...)
Affinity DataIC50:  6.90E+3nM. Assay description: Source (MLPCN Center Name): The Scripps Research Institute Molecular Screening Center (SRIMSC) Affiliation: The Scripps Research Institute, TSRI Assa...
Ligand InfoPC cidPC sid
In DepthDetails PCBioAssay