BDBM75924 4-[3,4-bis(chloranyl)phenoxy]-5-chloranyl-2-(4-propan-2-ylphenyl)pyridazin-3-one::5-chloro-4-(3,4-dichlorophenoxy)-2-(4-propan-2-ylphenyl)-3-pyridazinone::5-chloro-4-(3,4-dichlorophenoxy)-2-(4-propan-2-ylphenyl)pyridazin-3-one::5-chloro-4-(3,4-dichlorophenoxy)-2-p-cumenyl-pyridazin-3-one::SR-02000000455::SR-02000000455-1::cid_46835815
SMILES CC(C)c1ccc(cc1)-n1ncc(Cl)c(Oc2ccc(Cl)c(Cl)c2)c1=O
InChI Key InChIKey=YABUAIOJPKDZME-UHFFFAOYSA-N
Data  2 IC50
  Tab Delimited (TSV)   2D SDfile   Computed 3D by Vconf -m prep SDfile
Find this compound or compounds like it in BindingDB:
Activity Spreadsheet -- Enzyme Inhibition Constant Data from BindingDB
Found 2 hits for monomerid = 75924
TargetNeuropeptides B/W receptor type 1(Homo sapiens (Human))
The Scripps Research Institute Molecular Screening Center
Curated by PubChem BioAssay
LigandPNGBDBM75924(4-[3,4-bis(chloranyl)phenoxy]-5-chloranyl-2-(4-pro...)
Affinity DataIC50:  1.60E+4nM. Assay description: Source (MLPCN Center Name): The Scripps Research Institute Molecular Screening Center (SRIMSC) Affiliation: The Scripps Research Institute, TSRI Assa...
In DepthDetails PCBioAssay
TargetMelanin-concentrating hormone receptor 1(Homo sapiens (Human))
The Scripps Research Institute Molecular Screening Center
Curated by PubChem BioAssay
LigandPNGBDBM75924(4-[3,4-bis(chloranyl)phenoxy]-5-chloranyl-2-(4-pro...)
Affinity DataIC50:  1.59E+4nM. Assay description: Source (MLPCN Center Name): The Scripps Research Institute Molecular Screening Center (SRIMSC) Affiliation: The Scripps Research Institute, TSRI Assa...
In DepthDetails PCBioAssay